program: Gaussian 09
title: 000179771
version: EM64L-G09RevD.01
frameworkgroup: C1[X(C7H9BrN4)]
method: RPBEPBE
basis: SDD
operation: Freq
keyword: #p
keyword: freq=noraman
keyword: PBEPBE/SDD
title: #p freq=noraman PBEPBE/SDD
converged: NO YES NO NO
title: Mulliken charges:
elementType: Br N N N N C C C C C C C H H H H H H H H H
charge: -0.022239 -0.157028 -0.377412 -0.637349 -0.585075 0.240137 -0.387773 -0.369777 -0.172617 -0.162433 -0.231288 0.238819 0.258663 0.251830 0.242014 0.244354 0.319968 0.346282 0.345068 0.310178 0.305677
chargesum: 0.00000
title: Mulliken charges with hydrogens summed into heavy atoms:
elementType: Br N N N N C C C C C C C
charge: -0.022239 -0.157028 -0.057444 0.054002 0.030779 0.240137 -0.129111 -0.117947 0.069397 0.081921 -0.231288 0.238819
polarizability: 2.36936163e+02 2.73755776e+00 1.02555623e+02 2.89491246e+00 4.40573337e+00 5.84688298e+01
1716.lowfreq: -0.0008 -0.0005 0.0004 2.3436 3.7976 14.0920 43.0268 62.5675 76.9597
frequency: 43.0088 62.5620 76.9577 113.1644 145.2269 210.7856 226.1123 297.9502 322.1900 343.5842 388.9113 409.9619 413.4395 486.6013 505.1077 555.1507 599.2677 623.0289 629.9340 653.8079 676.3016 695.7587 709.9235 798.9707 818.4918 832.5877 933.0961 942.9682 959.3542 983.7909 1043.5421 1056.4296 1101.1389 1175.2987 1189.7085 1241.3214 1261.4139 1283.6146 1338.0373 1397.3725 1417.1668 1442.0088 1480.3819 1552.8577 1560.4881 1593.3700 1654.6498 1680.4622 3128.1357 3149.4887 3159.1446 3171.2379 3426.1101 3501.1339 3506.8637 3549.5142 3681.0817
redmass: 5.7834 3.9754 4.7974 5.2532 6.6354 8.8887 6.8312 5.5280 3.3414 1.2728 4.5280 3.8962 3.8958 1.2048 2.3343 1.0851 2.4126 3.8615 5.5071 1.6682 1.7448 3.1254 3.1806 4.9888 1.2456 1.7026 5.1484 1.3167 1.3525 4.7088 1.9934 2.3199 1.3584 1.1598 2.6780 1.1930 2.6731 1.2721 4.6759 4.0502 1.5618 3.0664 2.8737 7.0411 1.3293 6.2490 2.7942 1.4068 1.0884 1.0879 1.0956 1.0973 1.0413 1.0739 1.0494 1.1040 1.1021
irintensity: 2.7381 2.4433 4.8328 11.2129 0.8716 0.6216 4.5705 3.6128 2.1890 13.3862 5.1107 11.9837 12.2122 148.7933 24.0966 234.6909 47.7713 42.1313 38.9760 46.1537 103.0497 45.4125 9.7981 11.9485 0.7116 70.2820 31.3042 0.3769 0.9642 31.3618 3.7433 36.8727 11.5040 12.6751 19.9232 5.2802 51.2307 0.2957 8.9165 1.4662 48.9446 221.0134 64.0586 5.8911 263.6706 99.5268 811.5459 390.3333 9.0185 5.1703 10.7707 6.6685 3.8261 23.7058 73.9137 3.5394 68.3022
temp: 298.150 k
press: 1.00000 atm
elementType: 35 7 7 7 7 6 6 6 6 6 6 6 1 1 1 1 1 1 1 1 1
symmnumber: 1
zpe: 419889.1 jmol-1
zpe.correction: 0.159927 hartree
zpe.thermalcorrener: 0.171906 hartree
zpe.thermalcorrenthalpy: 0.172851 hartree
zpe.thermalcorrgfe: 0.120351 hartree
zpe.sumelectzpe: -503.700792 hartree
zpe.sumelectthermal: -503.688813 hartree
zpe.sumelectthermalent: -503.687869 hartree
zpe.sumelectthermalfe: -503.740369 hartree
dipole: -7.3936 -1.3598 0.9258
dipole: 7.5744
quadrupole: -47.4162 -74.0193 -81.6785
quadrupole: 3.1441 -0.8649 0.9744
quadrupole: 20.2885 -6.3146 -13.9738 3.1441 -0.8649 0.9744
hfenergy: -503.8607196 hartree
pointgroup: C01 [X(C7H9Br1N4)]
dipole: -2.9072703 0.2089096 0.6200757 debye
dipolederiv: -0.8374645 0.008278 -0.0823898 -0.0009229 -0.070544 0.015078 -0.1322456 0.0176407 -0.0953387 -2.5979316 0.0108542 0.2065449 -0.2540134 -0.3357811 -0.0085817 0.4786322 -0.0436089 -0.647697 -1.0867873 -0.0910226 -0.2188503 -0.2195305 -0.5374332 0.0560695 -0.2023066 0.0475516 -0.0996189 -0.6199748 0.0139963 -0.045332 0.0446407 -0.6219457 -0.0730946 0.5522326 -0.1079692 -1.110295 -0.1959532 -0.0531071 -0.1515551 -0.0118709 -0.0026922 -0.1255598 -0.4120215 -0.1259346 -0.5179539 1.9118155 -0.021513 -0.0113024 0.0968703 0.0621979 -0.0088937 0.2386916 -0.0123235 0.0263002 -0.410641 0.0185353 0.0648258 0.2100236 -0.1069912 -0.0924385 -0.2508778 -0.089968 -0.106948 -0.4505066 0.0295797 0.0156474 -0.1305802 -0.10928 -0.1158338 0.2011565 -0.0963871 -0.0067395 -0.1879591 0.0257812 -0.0617024 0.0250793 -0.0249622 -0.084999 -0.0629867 -0.0845921 0.0242282 -0.1526263 0.0312202 -0.0516175 0.0195928 -0.0309708 -0.0981895 0.0249136 -0.0850096 0.0248555 1.1733626 -0.0153948 0.2058864 0.0244323 -0.1438732 -0.0155691 0.1828111 -0.0283322 -0.0932445 2.7067499 0.0706237 -0.1485519 0.2512866 0.2929909 0.1950753 -0.8243376 0.258025 1.3185822 -0.020089 -0.0756881 0.0570176 -0.0707773 0.0838769 0.0827737 0.0397607 0.0804951 0.0508262 0.0452751 0.0313927 -0.0764767 0.0160048 0.0970192 0.0938144 -0.0575357 0.0960638 0.0175908 0.0534888 0.0359211 -0.0519537 0.0407687 0.0884214 0.095931 -0.0668354 0.0984507 0.0201165 0.0217248 -0.0593807 0.0717648 -0.0692785 0.099066 0.0794097 0.0670134 0.0780803 0.0549001 0.1397297 0.0090298 0.0922135 0.0284949 0.3604414 -0.0266222 0.0888891 -0.0453199 0.086536 0.1707866 -0.0206593 -0.0230144 -0.0710525 0.3285956 0.0016358 -0.070899 -0.0094732 0.2489049 0.3445503 0.0071425 0.038091 0.0024094 0.3520883 -0.0527412 0.0407463 -0.0360301 0.2308445 0.0197578 -0.0451002 0.0969722 -0.0354984 0.0916834 0.0123309 0.0760331 -0.0278878 0.3121192 -0.0273077 0.089511 0.0737823 0.1039213 0.1280925 0.0704048 0.0891657 0.116529 0.2620311 unknown
polarizability: 237.0084306|1.3468205|65.8185205|-1.6533728|-17.0439495|95.1336638 unknown
InChI: InChI=1S/C7H9BrN4/c8-5-1-3-6(4-2-5)11-7(9)12-10/h1-4,12H,9-10H2
charge 0 multiplicity 1
21 atoms
Br 4.897534 -0.103601 0.366477
N  -1.221792 -0.03343 -0.744148
N  -3.498183 -0.159338 -0.343934
N  -2.123655 0.301284 1.498009
N  -4.616549 0.035035 0.47907
C  0.146298 -0.046691 -0.416707
C  0.706138 -0.776084 0.680467
C  1.047704 0.640412 -1.284155
C  2.099807 -0.79824 0.90896
C  2.43848 0.630174 -1.058849
C  2.953453 -0.086178 0.043289
C  -2.195136 0.032108 0.144196
H  0.052945 -1.371357 1.329449
H  0.62942 1.178316 -2.140478
H  2.51062 -1.371745 1.74584
H  3.110105 1.169359 -1.73382
H  -3.567094 -0.321486 -1.352792
H  -1.230361 0.525369 1.926736
H  -3.006332 0.3992 2.002195
H  -5.171379 -0.810357 0.645695
H  -5.171822 0.871653 0.268098
