program: Gaussian 09
title: 000179748
version: EM64L-G09RevD.01
frameworkgroup: C1[X(C11H18O4)]
method: RPBEPBE
basis: SDD
operation: Freq
keyword: #pfreq=noraman
keyword: PBEPBE/SDD
title: #p freq=noraman PBEPBE/SDD
converged: YES YES NO NO
title: Mulliken charges:
elementType: O O O O C C C C C C C C C C C H H H H H H H H H H H H H H H H H H
charge: -0.485189 -0.451785 -0.279496 -0.258709 0.188862 -0.045685 -0.789411 -0.261449 -0.721110 -0.200011 -0.272276 0.205319 -0.769659 0.154727 -0.504883 0.210609 0.222990 0.263818 0.208004 0.256663 0.239845 0.221851 0.233827 0.348142 0.240222 0.361343 0.263482 0.247610 0.212420 0.246245 0.230458 0.241411 0.241814
chargesum: 0.00000
title: Mulliken charges with hydrogens summed into heavy atoms:
elementType: O O O O C C C C C C C C C C C
charge: -0.137047 -0.090442 -0.279496 -0.258709 0.188862 0.164924 -0.094599 -0.004786 -0.025586 0.040211 -0.008794 0.205319 -0.063383 0.154727 0.208800
polarizability: 2.65228791e+02 1.24483459e+01 1.19116927e+02 9.38888514e+00 2.71537525e+00 9.96369678e+01
1716.lowfreq: -0.0008 -0.0006 -0.0003 3.5138 5.7826 13.9329 28.9500 39.7505 58.9619
frequency: 28.7605 39.5960 58.9480 61.8082 98.2600 103.2915 116.4080 137.9234 160.4210 166.9381 199.9209 212.5078 243.8694 245.4557 266.5256 275.9157 296.9900 307.3754 328.1048 343.2169 358.5078 403.1705 424.3099 455.5954 486.1755 496.6607 531.1766 533.9550 614.0286 668.3602 703.7479 734.5509 782.4140 823.8464 879.3452 884.1577 913.9346 931.1867 949.2622 988.6716 996.8039 1023.1151 1039.1348 1042.2519 1069.5031 1077.4802 1097.4024 1114.5519 1116.4806 1147.2370 1194.7298 1203.0515 1225.2041 1264.2788 1267.8027 1292.6787 1302.4031 1351.0531 1367.7116 1373.7251 1391.4919 1401.3622 1406.8808 1423.0674 1450.9916 1457.6721 1459.1679 1463.6183 1465.8686 1469.0841 1476.1345 1491.9439 1592.0475 1612.1047 1652.0644 2947.9694 2987.4821 2992.1662 2998.5761 3002.2210 3068.2942 3076.1035 3088.4654 3097.9042 3101.7709 3101.9540 3102.2608 3102.7091 3103.8551 3125.1577 3146.2524 3507.1204 3566.4292
redmass: 4.2970 3.7061 4.5608 4.6346 1.2806 2.4874 1.1436 2.7045 3.4307 3.8692 2.2674 1.3649 3.2541 1.7289 2.7668 1.8008 2.1224 1.0863 3.7702 3.6317 3.2775 4.1074 2.9330 4.1674 3.5142 4.1699 1.1445 3.4867 3.0504 3.8301 5.7954 3.3453 4.4074 2.8298 2.0551 2.2131 2.2831 4.8067 1.4422 2.1257 1.1835 1.6484 1.7030 1.4201 2.3001 2.0438 1.9638 1.2668 2.0456 1.4667 1.9833 3.1172 1.8836 1.2104 2.2484 1.7262 1.4406 1.3039 1.6222 1.3486 1.2879 1.4279 1.2582 1.1937 1.0496 1.0448 1.0503 1.0548 1.0554 1.0846 1.0479 1.0525 8.8491 6.5489 5.9674 1.0843 1.0373 1.0372 1.0361 1.0296 1.0968 1.0984 1.0901 1.0997 1.0924 1.0983 1.1042 1.0985 1.0983 1.0880 1.1046 1.0644 1.0665
irintensity: 0.4560 0.0462 2.6195 0.3526 1.1042 2.6678 0.7294 0.9697 4.5828 2.5611 0.8508 1.7564 3.0752 4.1615 13.3447 0.8385 2.5162 143.5512 12.1432 23.9826 7.3135 1.6278 4.4718 6.7977 6.6046 15.8630 212.0992 17.2799 13.9457 12.1970 16.2916 1.7214 9.8036 35.7699 9.2539 51.5567 8.3233 2.0893 1.2902 6.3757 63.6618 14.6895 121.5398 0.5181 112.2790 245.7027 53.2817 0.0260 38.5467 66.2306 162.7616 196.3093 47.5909 98.2561 23.5743 29.7297 17.9777 0.4643 18.5172 61.3567 34.6453 55.7075 29.7118 30.4604 14.1060 12.4410 2.2996 18.7820 6.7525 21.2668 15.6749 1.8499 214.2340 5.6397 41.2132 50.0687 13.5057 16.7188 12.1269 45.9341 12.1961 29.3060 6.0231 32.8288 11.6649 20.4466 27.7398 6.3967 21.6228 25.3715 20.3151 25.6076 10.8992
temp: 298.150 k
press: 1.00000 atm
elementType: 8 8 8 8 6 6 6 6 6 6 6 6 6 6 6 1 1 1 1 1 1 1 1 1 1 1 1 1 1 1 1 1 1
symmnumber: 1
zpe: 712687.7 jmol-1
zpe.correction: 0.271448 hartree
zpe.thermalcorrener: 0.289812 hartree
zpe.thermalcorrenthalpy: 0.290756 hartree
zpe.thermalcorrgfe: 0.224600 hartree
zpe.sumelectzpe: -729.644925 hartree
zpe.sumelectthermal: -729.626562 hartree
zpe.sumelectthermalent: -729.625617 hartree
zpe.sumelectthermalfe: -729.691774 hartree
dipole: 2.3587 2.5099 -0.9033
dipole: 3.5607
quadrupole: -96.2610 -92.7095 -87.4902
quadrupole: 2.2512 6.2639 -1.7590
quadrupole: -4.1074 -0.5559 4.6633 2.2512 6.2639 -1.7590
hfenergy: -729.9163739 hartree
pointgroup: C01 [X(C11H18O4)]
dipole: 0.9220496 -1.0231216 -0.2560255 debye
polarizability: 265.3795553|-6.3024394|110.4717969|-13.3499959|10.1255319|108.1313334 unknown
InChI: InChI=1S/C11H18O4/c1-8(10(13)15-4)6-5-7-11(3,14)9(2)12/h5-7,9,12,14H,1-4H3
charge 0 multiplicity 1
33 atoms
O  -3.446817 -0.54392 1.718007
O  -5.13325 0.528488 -0.041013
O  4.629074 -0.277681 -0.274951
O  3.538987 1.239458 1.118895
C  -2.83741 -0.30395 0.358342
C  -3.718367 0.896355 -0.14062
C  -3.013904 -1.564367 -0.502103
C  -1.409502 0.137245 0.582216
C  -3.459213 1.31485 -1.587664
C  -0.282978 -0.410052 0.0246
C  1.052381 0.077921 0.326967
C  2.241365 -0.397322 -0.184492
C  2.387531 -1.531047 -1.175984
C  3.47767 0.283991 0.300974
C  5.90838 0.333333 0.150918
H  -3.504804 1.744069 0.547548
H  -2.576801 -1.437965 -1.508225
H  -4.090289 -1.771834 -0.620314
H  -2.530951 -2.440269 -0.0303
H  -1.302173 0.974397 1.289655
H  -4.07044 2.200891 -1.82812
H  -2.395768 1.567673 -1.744467
H  -3.746458 0.509134 -2.28455
H  -2.960084 -1.284928 2.160217
H  -0.385633 -1.246859 -0.677581
H  -5.260895 0.161053 0.874859
H  1.127309 0.913112 1.038792
H  2.91286 -1.189559 -2.085994
H  1.413075 -1.950097 -1.473507
H  3.003731 -2.344876 -0.752824
H  6.682593 -0.226568 -0.39246
H  6.035875 0.233931 1.242232
H  5.929607 1.403792 -0.114954
