program: Gaussian 09
title: 000016417
version: EM64L-G09RevD.01
frameworkgroup: C1[X(C22H27ClO3)]
method: RPBEPBE
basis: SDD
operation: Freq
keyword: #p
keyword: freq=noraman
keyword: PBEPBE/SDD
title: #p freq=noraman PBEPBE/SDD
converged: NO YES NO NO
title: Mulliken charges:
elementType: Cl O O O C C C C C C C C C C C C C C C C C C C C C C H H H H H H H H H H H H H H H H H H H H H H H H H H H
charge: -0.055659 -0.456747 -0.231390 -0.209397 0.228267 -0.166340 -0.252445 0.328040 -0.169994 -0.165810 -0.348472 -0.521346 -0.490346 -0.512848 0.142232 -0.501119 0.618037 -0.577533 -0.781762 -0.218699 -0.817087 0.188281 -0.417518 -0.606532 0.137230 -0.780823 0.209786 0.255347 0.250799 0.240351 0.275042 0.253413 0.250436 0.240362 0.219138 0.220175 0.232064 0.223951 0.231298 0.276375 0.218059 0.245134 0.236671 0.215670 0.256867 0.258302 0.249047 0.211341 0.275849 0.333719 0.237110 0.274622 0.248852
chargesum: 0.00000
title: Mulliken charges with hydrogens summed into heavy atoms:
elementType: Cl O O O C C C C C C C C C C C C C C C C C C C C C C
charge: -0.055659 -0.123028 -0.231390 -0.209397 0.228267 0.043446 0.002902 0.328040 0.080804 0.074541 -0.073430 -0.017496 -0.030846 -0.060609 0.142232 -0.045871 0.618037 -0.083099 -0.084286 0.038168 -0.098397 0.188281 -0.417518 -0.330683 0.137230 -0.020238
polarizability: 3.32073341e+02 -1.05041017e+01 2.26231031e+02 -2.00949303e+01 -2.29345107e+00 1.96792532e+02
1716.lowfreq: -4.1301 0.0020 0.0024 0.0027 6.1120 9.5197 40.4125 42.0029 55.8348
frequency: 40.4022 41.9825 55.8140 66.6223 85.3711 108.2193 116.7904 118.6032 131.3402 153.0768 168.4464 188.5691 191.0471 208.0516 215.7729 227.8303 244.8503 254.1467 265.9682 269.7418 278.5049 284.6516 296.0600 331.9543 339.0839 343.6401 361.3480 377.9414 381.6571 398.2618 407.9329 434.3326 455.0780 468.0589 484.2067 512.2961 518.2373 539.0736 553.6333 575.9092 601.4290 609.4412 624.2101 667.0812 677.8397 693.3920 713.0885 733.4431 764.8123 774.4562 799.5355 808.3698 822.3866 836.3605 848.7386 860.5095 882.1518 899.7520 913.9537 918.4216 931.0699 934.4108 950.6712 958.9583 966.4843 983.0499 992.2002 996.0584 1003.7355 1012.4078 1034.3821 1042.9749 1049.1718 1059.8344 1068.8609 1070.7468 1075.3578 1087.6011 1099.9214 1103.3810 1115.3318 1123.7678 1142.5724 1158.9998 1166.5841 1170.1469 1187.6794 1205.5996 1212.4255 1217.7434 1225.7979 1249.6681 1259.1985 1268.2101 1272.5099 1278.3078 1282.7452 1289.4161 1305.1254 1311.2498 1325.5755 1332.8347 1335.8254 1338.0354 1342.3902 1348.3844 1360.3214 1363.8235 1369.8423 1388.8482 1393.2643 1436.2470 1442.9851 1451.2515 1457.7464 1466.5286 1469.6075 1472.1009 1477.2674 1485.7645 1486.9266 1489.1682 1564.1932 1596.1811 1610.8975 1612.0066 2916.1543 2963.4553 2979.2558 2983.6215 2987.3206 2989.1229 2992.2715 2993.9561 2995.8668 3005.0136 3043.8278 3052.7266 3063.6641 3069.5093 3075.5452 3076.9383 3077.5803 3091.2430 3095.1858 3099.9882 3103.1636 3130.0370 3132.3119 3152.0765 3158.2875 3208.1299 3560.5968
redmass: 5.4677 5.8464 4.9177 3.7297 5.8819 2.9175 1.0816 5.5954 2.7910 4.5847 6.4138 2.8530 1.8252 2.4745 2.5434 2.3568 3.7618 1.9225 1.9038 2.5873 3.1868 1.1940 3.2893 3.0758 3.6473 3.2273 4.2679 4.1927 3.3761 3.2774 3.1584 3.5947 4.7390 3.4226 4.0095 4.6516 3.7081 5.3447 3.1188 3.3925 4.3388 3.1336 4.4181 3.0208 2.9662 3.2020 4.7478 3.4481 2.3882 2.4692 2.1962 1.9269 2.1190 2.6918 1.5990 2.0870 2.1986 2.4513 2.1194 1.7551 2.0000 2.1389 3.2915 1.9596 2.1740 2.1344 1.8129 1.9853 2.0375 1.8893 1.9943 2.2939 1.8367 1.9408 1.8824 1.8489 1.7342 2.1925 1.2249 1.8695 2.3050 1.6144 1.9822 2.8377 1.8034 2.3497 2.0542 1.4215 1.7422 1.8919 1.6544 1.4071 1.3502 1.8602 1.8214 1.6369 1.4200 1.4605 1.3718 1.5072 1.5020 1.5393 1.7776 2.3240 1.4064 2.0429 2.2357 1.4527 1.2316 1.2070 1.2374 1.0735 1.0614 1.2220 1.0861 1.0587 1.0735 1.0697 1.0676 1.0562 1.0839 1.0654 9.8935 7.5019 8.6499 9.3059 1.0800 1.0827 1.0368 1.0383 1.0408 1.0630 1.0803 1.0609 1.0649 1.0676 1.0990 1.0992 1.0993 1.0966 1.0980 1.0978 1.0906 1.0992 1.0839 1.0990 1.0613 1.1030 1.0915 1.0906 1.0927 1.1156 1.0661
irintensity: 1.4696 1.4251 3.3277 0.2772 3.1212 0.3065 2.6961 0.7745 0.4847 2.4982 0.4100 1.3878 0.0791 1.2788 0.3570 0.5327 1.6478 1.7355 1.7363 5.9598 1.6062 119.6034 2.8484 8.2633 0.3067 1.0070 8.7658 6.8722 3.0533 0.7609 0.5070 4.1845 2.1646 2.0593 0.9579 7.4036 0.9829 2.3323 3.8364 11.7224 8.4413 9.0978 3.0158 2.2830 5.9886 2.2615 2.4171 19.3970 5.1317 2.1664 8.0444 2.0930 9.2602 7.1150 17.4232 33.3000 38.4652 4.4166 17.8415 27.8398 8.2870 24.0226 16.4737 4.1229 9.2340 2.8781 12.1387 5.2163 17.3976 3.0363 13.2362 10.6044 22.5857 13.5609 2.1537 12.4473 15.5959 2.3392 0.7319 26.1617 9.9086 3.0923 16.1615 9.4766 3.5362 4.5675 8.7441 4.0189 69.5987 50.0584 7.7019 3.3481 4.6950 10.8241 24.2690 15.4052 20.7094 10.5037 4.3824 0.5452 4.2380 13.2862 17.1505 28.6263 3.9481 8.3791 10.0703 6.1232 69.1491 26.9118 14.5753 23.3496 19.9702 8.5881 2.8939 9.0590 5.4997 4.8228 1.8648 7.0848 8.5861 26.7204 151.5739 201.0965 51.9523 54.7706 17.4126 21.9098 24.5969 19.5931 3.4797 32.8846 11.0008 32.2483 16.7972 41.0059 28.5530 14.1679 21.5709 44.5241 19.3355 23.2515 15.4885 16.7371 14.3269 12.0721 9.7419 8.1736 3.0979 0.9207 7.2003 9.3280 3.9074
temp: 298.150 k
press: 1.00000 atm
elementType: 17 8 8 8 6 6 6 6 6 6 6 6 6 6 6 6 6 6 6 6 6 6 6 6 6 6 1 1 1 1 1 1 1 1 1 1 1 1 1 1 1 1 1 1 1 1 1 1 1 1 1 1 1
symmnumber: 1
zpe: 1149749.5 jmol-1
zpe.correction: 0.437916 hartree
zpe.thermalcorrener: 0.462636 hartree
zpe.thermalcorrenthalpy: 0.463580 hartree
zpe.thermalcorrgfe: 0.385668 hartree
zpe.sumelectzpe: -1538.275420 hartree
zpe.sumelectthermal: -1538.250701 hartree
zpe.sumelectthermalent: -1538.249756 hartree
zpe.sumelectthermalfe: -1538.327668 hartree
dipole: -6.6115 -0.6840 2.9993
dipole: 7.2922
quadrupole: -193.8710 -167.4267 -155.7249
quadrupole: -15.6081 0.8371 -1.7634
quadrupole: -21.5301 4.9142 16.6160 -15.6081 0.8371 -1.7634
hfenergy: -1538.7133362 hartree
pointgroup: C01 [X(C22H27Cl1O3)]
dipole: -2.5163782 0.1231652 -1.3724355 debye
polarizability: 331.2380472|8.1382912|221.027947|24.0316976|-10.473889|202.8309097 unknown
InChI: InChI=1S/C22H27ClO3/c1-11(24)22(26)7-5-14-12-9-18(23)17-10-19(25)13-8-16(13)21(17,3)15(12)4-6-20(14,22)2/h9-10,12-16,26H,4-8H2,1-3H3
charge 0 multiplicity 1
53 atoms
Cl 2.120392 -3.220044 1.581932
O  -4.483309 -1.157019 -0.33247
O  5.971026 0.27169 0.900015
O  -4.468525 2.457861 0.01537
C  2.105392 0.279152 -0.820789
C  0.540539 0.443683 -0.86232
C  2.788299 1.63833 -0.599108
C  -2.335551 -0.067127 0.08786
C  -1.703397 -0.861958 -1.109287
C  -0.146884 -0.93216 -1.117959
C  4.198171 1.679127 0.039581
C  2.966738 2.29581 0.759513
C  -0.065508 1.118017 0.394392
C  -1.595338 1.291304 0.264226
C  -3.806656 0.156991 -0.465226
C  -2.288165 -0.201929 -2.396749
C  2.534848 -0.748299 0.248537
C  -3.603002 0.511324 -1.961938
C  2.617257 -0.26304 -2.197798
C  0.392585 -1.982098 -0.16432
C  -2.328291 -0.86381 1.413116
C  4.738557 0.407551 0.613071
C  1.607337 -1.864359 0.442951
C  3.769096 -0.685104 0.853094
C  -4.599806 1.237567 0.308576
C  -5.535671 0.779492 1.41606
H  0.32104 1.105945 -1.726808
H  2.643973 2.323037 -1.44516
H  -2.093027 -1.897434 -1.049626
H  0.125595 -1.268202 -2.14456
H  4.95441 2.364783 -0.351877
H  2.61002 1.777071 1.653243
H  2.925854 3.387548 0.814165
H  0.390086 2.113545 0.532445
H  0.179639 0.528616 1.298927
H  -1.984135 1.810703 1.160458
H  -1.808213 1.963049 -0.589619
H  -2.469639 -0.965915 -3.173113
H  -1.578201 0.5292 -2.825337
H  -3.531417 1.607021 -2.065889
H  -4.47577 0.190349 -2.562673
H  3.720898 -0.257327 -2.216777
H  2.286051 -1.297847 -2.389013
H  2.252066 0.379112 -3.021913
H  -0.22175 -2.872558 0.015792
H  -2.943746 -1.773809 1.324244
H  -1.302522 -1.16462 1.687567
H  -2.723074 -0.254028 2.247407
H  4.109761 -1.493655 1.509008
H  -5.260002 -1.173277 -0.947004
H  -6.488837 0.423288 0.977874
H  -5.114901 -0.072424 1.973687
H  -5.759391 1.627578 2.082625
