program: Gaussian 09
title: 000179735
version: EM64L-G09RevD.01
frameworkgroup: C1[X(C8H7ClN2O2)]
method: RPBEPBE
basis: SDD
operation: Freq
keyword: #p
keyword: freq=noraman
keyword: PBEPBE/SDD
title: #p freq=noraman PBEPBE/SDD
converged: YES YES NO NO
title: Mulliken charges:
elementType: Cl O O N N C C C C C C C C H H H H H H H
charge: 0.020152 -0.254434 -0.233761 -0.161873 -0.025478 0.332612 0.107573 0.049288 -0.075487 -0.248439 -0.623008 -0.521416 -0.203898 0.284567 0.253179 0.292322 0.253176 0.255185 0.255244 0.244496
chargesum: 0.00000
title: Mulliken charges with hydrogens summed into heavy atoms:
elementType: Cl O O N N C C C C C C C C
charge: 0.020152 -0.254434 -0.233761 -0.161873 -0.025478 0.332612 0.107573 0.049288 -0.075487 0.036129 0.175670 0.233509 -0.203898
polarizability: 1.77424946e+02 -7.34697972e+00 1.30836721e+02 1.77377056e-02 -2.95214796e-03 5.40973245e+01
1716.lowfreq: -7.7885 -7.1066 0.0019 0.0026 0.0030 3.4251 40.6016 79.6338 89.3814
frequency: 40.5858 79.6333 89.3796 148.1056 149.9157 176.7957 205.2985 228.9297 238.9651 249.7025 291.5838 324.4318 338.7149 386.3479 444.3233 459.0702 499.9497 521.5345 587.2062 632.0205 647.9994 660.2725 751.3727 780.8068 808.5726 912.7518 931.9904 1021.0423 1106.0729 1110.3422 1122.1059 1171.0817 1177.8872 1197.2050 1205.8668 1316.9081 1391.3769 1434.4348 1458.7357 1463.1552 1469.3171 1472.4927 1489.1991 1526.3305 1585.4939 1625.8260 2173.4210 3009.3809 3010.3851 3106.6907 3121.8693 3132.6463 3144.7292 3222.0108
redmass: 4.6363 5.3612 5.0456 11.9976 1.1170 3.6380 5.2848 1.1174 6.7781 5.0386 5.2488 13.9126 4.3935 4.6737 7.9639 8.7440 12.1560 9.3516 6.5799 4.8985 5.2581 6.3885 7.8195 6.8588 1.4933 7.9741 5.9691 3.0216 1.2547 2.7501 1.2976 1.8180 2.2832 2.2974 4.2040 5.1027 1.7740 1.3113 1.2452 1.1585 1.0482 1.3083 1.0441 8.2906 8.1938 10.5348 12.6202 1.0328 1.0293 1.1032 1.1059 1.1013 1.1047 1.0937
irintensity: 6.5226 3.1949 1.7921 1.4083 0.2934 3.5127 1.5041 0.0155 0.0014 7.1625 6.6371 11.8353 2.9058 1.6998 16.0742 6.1276 0.0280 1.0842 1.1589 3.7659 2.0709 5.7076 3.7296 5.8859 42.8600 1.1999 14.6404 164.4573 0.0299 54.9977 0.1478 47.5966 38.7309 15.1749 18.6042 129.2068 82.1713 7.3033 9.2823 57.7998 19.5007 27.4895 21.9481 201.3475 182.7862 541.3231 43.0742 31.8476 22.2665 13.4442 17.2989 1.1104 16.1757 6.4006
temp: 298.150 k
press: 1.00000 atm
elementType: 17 8 8 7 7 6 6 6 6 6 6 6 6 1 1 1 1 1 1 1
symmnumber: 1
zpe: 363977.4 jmol-1
zpe.correction: 0.138632 hartree
zpe.thermalcorrener: 0.151438 hartree
zpe.thermalcorrenthalpy: 0.152382 hartree
zpe.thermalcorrgfe: 0.098917 hartree
zpe.sumelectzpe: -1028.088371 hartree
zpe.sumelectthermal: -1028.075565 hartree
zpe.sumelectthermalent: -1028.074620 hartree
zpe.sumelectthermalfe: -1028.128086 hartree
dipole: 2.9928 -4.3840 0.0067
dipole: 5.3081
quadrupole: -79.3146 -91.4699 -81.5792
quadrupole: 18.1453 -0.0085 0.0126
quadrupole: 4.8066 -7.3486 2.5420 18.1453 -0.0085 0.0126
hfenergy: -1028.2270027 hartree
pointgroup: C01 [X(C8H7Cl1N2O2)]
dipole: -1.1619764 1.7031648 -0.3321251 debye
dipolederiv: -0.7816793 0.2601083 -0.1417026 0.2501768 -0.1979712 0.0551341 -0.14131 0.0567889 -0.0446759 -1.2132328 -0.6845868 -0.0799442 -0.6206421 -0.8656194 -0.0427976 -0.086419 -0.0530862 -0.2967276 -0.4313498 0.0254789 -0.0172385 -0.032919 -1.2727202 0.0808751 -0.0116685 0.0898119 -0.3443682 -0.6748864 0.4786507 -0.1281931 -0.4016064 -1.0403629 0.022451 -0.0475487 0.1572077 -0.1493109 -0.4785442 0.0659856 -0.0414598 0.0670212 -0.2554296 0.0109452 -0.0416042 0.0107931 -0.2545031 1.3487908 0.4296663 0.1392664 0.156729 1.310056 -0.0778664 0.1650471 -0.0357443 0.2192111 0.7690985 -0.1811728 0.1029462 0.0504936 1.5347647 -0.1135979 0.08101 -0.1488613 0.2335353 -0.3802872 -0.163449 -0.0349002 0.093875 -0.7390681 0.076781 -0.0586999 0.0373311 -0.0684446 1.3742757 -0.2727043 0.2330054 0.4405574 1.036845 -0.0255098 0.1680617 -0.1351291 0.0666006 -1.2372189 -0.1177616 -0.1470029 -0.1717395 -0.305262 -0.0176977 -0.1419698 -0.0094372 -0.2324976 0.2596609 0.1465404 -0.0041098 0.2785477 0.1974448 0.0424124 -0.0158591 0.0223944 0.1927971 0.7632788 0.2883407 0.0494778 0.0178824 0.2049056 0.0086504 0.0744431 0.0505447 0.2761748 0.4582085 -0.1665959 0.0759811 -0.1854778 0.0470729 -0.0269943 0.0778277 -0.0243861 0.0752726 0.0906637 0.0141452 -0.0175638 0.0235203 0.0643774 0.0157255 -0.01884 0.014252 0.1920837 -0.0356472 -0.0423564 0.0683472 0.012694 0.0821994 -0.0742364 0.0850994 -0.0318987 0.0012893 0.1852992 0.1237351 -0.0041292 -0.0264847 0.0377556 0.0051898 0.0096916 0.0281738 0.1369863 0.0095163 -0.0583848 -0.0537681 -0.0220443 0.0967842 0.0507429 -0.0787792 -0.0055228 -0.0579746 -0.028637 -0.0337433 0.000188 0.1086207 0.0624657 -0.0877712 0.019357 -0.0903575 -0.0193692 -0.021526 -0.0555616 0.0122284 0.0754092 0.0920275 0.0955771 -0.0315155 0.0561282 -0.0556182 0.0242163 -0.0563348 -0.0114284 -0.1146133 -0.0902653 0.0019869 -0.0063236 0.0109974 0.1295392 unknown
polarizability: 174.5851871|-5.6118013|130.0372459|19.0242167|-7.8207079|57.7365578 unknown
InChI: InChI=1S/C8H7ClN2O2/c1-11-7(9)3-6(13-2)5(4-10)8(11)12/h3H,1-2H3
charge 0 multiplicity 1
20 atoms
Cl -3.613236 1.396618 -0.440142
O  1.341489 2.237042 0.247485
O  -0.330455 -2.392642 0.41326
N  -1.776863 -0.575255 0.025334
N  2.978806 -1.318879 0.821671
C  0.426359 1.206606 0.200264
C  -0.452597 -1.142587 0.280219
C  0.655993 -0.179514 0.362205
C  -1.937816 0.781659 -0.124682
C  -0.901015 1.687533 -0.048341
C  -2.908276 -1.529463 -0.059405
C  2.784754 2.017119 0.48974
C  1.933474 -0.775018 0.612033
H  -1.067135 2.756612 -0.172036
H  -3.65586 -1.310736 0.720589
H  -2.483998 -2.531931 0.097465
H  -3.385838 -1.473651 -1.051303
H  3.226878 1.394618 -0.304805
H  2.952503 1.551939 1.474456
H  3.213133 3.029131 0.466294
