program: Gaussian 09
title: 000179753
version: EM64L-G09RevD.01
frameworkgroup: C1[X(C15H17ClN2OS)]
method: RPBEPBE
basis: SDD
operation: Freq
keyword: #p
keyword: freq=noraman
keyword: PBEPBE/SDD
title: #p freq=noraman PBEPBE/SDD
converged: NO YES NO NO
title: Mulliken charges:
elementType: Cl S O N N C C C C C C C C C C C C C C C H H H H H H H H H H H H H H H H H
charge: -0.040289 0.244244 -0.208398 -0.204229 -0.080174 0.296105 -0.629686 -0.704685 -0.714908 -0.715588 0.327074 -0.214685 -0.121453 -0.166895 -0.193181 -0.226100 -0.341549 -0.207714 -0.191942 -0.102533 0.296312 0.230077 0.195978 0.224833 0.270340 0.222954 0.204731 0.251378 0.218311 0.205262 0.269746 0.291522 0.262767 0.265457 0.260664 0.262169 0.264084
chargesum: 0.00000
title: Mulliken charges with hydrogens summed into heavy atoms:
elementType: Cl S O N N C C C C C C C C C C C C C C C
charge: -0.040289 0.244244 -0.208398 -0.204229 -0.080174 0.296105 -0.333374 -0.053797 -0.016883 -0.040637 0.327074 -0.214685 0.148293 0.124627 0.069586 0.039357 -0.080885 0.054456 0.072142 -0.102533
polarizability: 2.78469680e+02 1.51022693e+01 1.91958842e+02 -1.77465550e+01 9.75073013e+00 1.49865188e+02
1716.lowfreq: -7.7855 -4.1926 -0.0020 -0.0018 -0.0015 8.8616 18.9502 24.5213 35.2050
frequency: 18.1312 23.1463 35.0347 47.0600 73.6129 90.5674 109.5285 141.3482 150.5553 161.7058 186.5883 204.4711 216.8415 238.3823 256.3804 265.2407 284.9688 292.7065 310.8201 320.6672 333.5699 345.8505 389.9799 406.0807 410.5360 475.6365 487.4046 510.2602 513.0949 592.0714 618.8585 625.2553 650.5738 697.2680 714.5474 724.1420 731.9997 762.9643 794.7232 819.1843 821.6442 830.5071 861.4799 868.3673 893.4261 928.6329 932.4858 947.5648 953.8320 964.2423 965.5847 991.2766 1013.5132 1025.8479 1032.4328 1065.6787 1071.4566 1073.0179 1101.4178 1109.4991 1142.0397 1175.0842 1180.4880 1216.8716 1221.8474 1234.0313 1247.5048 1260.0883 1283.7145 1313.3393 1352.9379 1355.3662 1373.4699 1377.7684 1381.5520 1404.3196 1440.2654 1454.7826 1457.5440 1470.3597 1471.7744 1482.4922 1486.2488 1490.3924 1503.7810 1573.1089 1573.6830 1616.3851 2965.4859 2974.8635 2985.5318 3060.0881 3062.3718 3067.7467 3071.3107 3079.9295 3092.0398 3113.0426 3146.0059 3156.7414 3171.5830 3178.1679 3233.0928 3261.3117 3270.5157
redmass: 7.8332 4.0986 6.2066 6.0242 3.7938 3.2347 6.5011 6.3420 4.7453 7.1925 3.9782 1.6394 3.0452 3.1951 1.1389 1.6209 2.2052 2.4474 4.4292 4.7111 6.5921 6.2237 2.6576 2.8619 2.7370 2.7338 3.3448 7.0800 6.1867 3.8123 6.8483 5.2968 3.7117 4.0316 6.7948 1.3790 3.7098 5.2873 4.6065 1.4299 1.3725 1.3521 1.4157 6.1980 2.9357 1.6490 1.7057 1.3288 1.2225 1.7409 2.2342 5.4620 1.8625 1.4614 1.5355 6.9524 2.3955 3.0020 1.3715 1.3574 1.2292 1.9016 1.1213 2.3059 2.7541 3.3372 2.4794 2.1841 1.2438 1.8717 4.0591 3.1096 1.1974 1.2017 3.9115 1.2127 3.8624 2.1073 1.0501 1.0544 1.0549 1.0921 1.0747 3.7825 1.0626 7.2552 6.6385 9.6313 1.0364 1.0366 1.0373 1.0937 1.0914 1.0960 1.0989 1.0990 1.0995 1.0986 1.0894 1.0893 1.0963 1.0976 1.0930 1.0977 1.1081
irintensity: 0.3049 0.3245 0.5252 0.2928 1.4009 0.0658 0.0277 0.1133 1.0726 2.7128 1.7084 0.8212 0.1984 4.5501 0.0273 0.3429 1.0678 0.4439 0.9829 3.8760 1.7254 4.7578 0.0162 0.3203 0.3157 1.3662 24.9186 16.8977 5.7689 1.2413 0.0999 0.5598 23.6243 0.0946 10.2701 39.8029 11.0387 18.7659 38.0959 35.2265 33.3690 27.2975 0.6065 6.3867 38.3831 1.0469 4.3076 0.2318 0.2217 10.6091 21.3808 59.4152 21.4550 2.1519 11.0804 11.1579 40.6281 8.2801 7.1009 44.9464 1.2268 178.9924 1.8250 9.5395 1.8143 41.6593 7.7022 191.7917 1.2565 25.3713 23.5205 71.9177 25.5429 30.2193 8.0690 37.4917 50.5542 97.2366 0.7669 0.4429 3.6231 18.7435 15.8358 9.9667 31.0286 4.7565 11.1982 201.7240 23.2418 31.6842 25.2972 7.2719 4.2809 40.4106 31.1669 67.8547 19.0037 8.0998 1.5849 0.8708 2.5367 0.9430 2.8782 2.4476 2.7945
temp: 298.150 k
press: 1.00000 atm
elementType: 17 16 8 7 7 6 6 6 6 6 6 6 6 6 6 6 6 6 6 6 1 1 1 1 1 1 1 1 1 1 1 1 1 1 1 1 1
symmnumber: 1
zpe: 753137.4 jmol-1
zpe.correction: 0.286855 hartree
zpe.thermalcorrener: 0.307120 hartree
zpe.thermalcorrenthalpy: 0.308065 hartree
zpe.thermalcorrgfe: 0.235980 hartree
zpe.sumelectzpe: -1623.158884 hartree
zpe.sumelectthermal: -1623.138619 hartree
zpe.sumelectthermalent: -1623.137675 hartree
zpe.sumelectthermalfe: -1623.209759 hartree
dipole: 0.7157 -3.8991 -1.9295
dipole: 4.4089
quadrupole: -140.9929 -147.8463 -130.7699
quadrupole: 8.4377 5.5578 5.7692
quadrupole: -1.1232 -7.9766 9.0998 8.4377 5.5578 5.7692
hfenergy: -1623.4457391 hartree
pointgroup: C01 [X(C15H17Cl1N2O1S1)]
dipole: -0.3451905 -1.0904945 -1.304022 debye
polarizability: 270.6745002|4.3998956|172.2608592|-35.8090506|23.7861056|177.3583505 unknown
InChI: InChI=1S/C15H17ClN2OS/c1-15(2,3)13(14(19)18-9-8-17-10-18)20-12-6-4-11(16)5-7-12/h4-10,13H,1-3H3
charge 0 multiplicity 1
37 atoms
Cl 4.936756 -1.283794 -2.177905
S  -0.707564 -1.522808 0.967592
O  -2.587808 1.193287 2.002875
N  -0.689507 1.988595 0.92759
N  0.511643 3.859773 1.421012
C  -3.178449 -0.662405 -0.320661
C  -1.767355 -0.138766 0.098791
C  -2.991001 -1.688502 -1.470505
C  -3.944573 -1.338162 0.846872
C  -3.997316 0.54947 -0.856778
C  -1.751935 1.030784 1.079681
C  0.8760 -1.408357 0.035635
C  0.355279 2.069057 -0.029123
C  -0.532921 3.108224 1.779458
C  0.933594 -1.668715 -1.356041
C  2.063227 -1.121197 0.75109
C  1.07103 3.212624 0.289753
C  2.170271 -1.621327 -2.037371
C  3.308428 -1.091953 0.082757
C  3.340354 -1.33547 -1.304193
H  -1.199745 0.109955 -0.812669
H  -2.383493 -2.55019 -1.138893
H  -2.504979 -1.226734 -2.352458
H  -3.976348 -2.070629 -1.792494
H  -4.100401 -0.638025 1.682656
H  -3.396419 -2.221295 1.223804
H  -4.930027 -1.685085 0.484647
H  -4.219774 1.274574 -0.055364
H  -4.959476 0.190311 -1.265058
H  -3.463195 1.075767 -1.671759
H  0.510188 1.331293 -0.809086
H  -1.212639 3.288584 2.606776
H  0.023721 -1.926251 -1.90797
H  2.015371 -0.910164 1.823614
H  1.94855 3.617598 -0.208583
H  2.222894 -1.821374 -3.111394
H  4.228321 -0.869693 0.630703
