program: Gaussian 09
title: 000179805
version: EM64L-G09RevD.01
frameworkgroup: C1[X(C21H22O4)]
method: RPBEPBE
basis: SDD
operation: Freq
keyword: #pfreq=noraman
keyword: PBEPBE/SDD
title: #p freq=noraman PBEPBE/SDD
converged: YES YES NO NO
title: Mulliken charges:
elementType: O O O O C C C C C C C C C C C C C C C C C C C C C H H H H H H H H H H H H H H H H H H H H H H
charge: -0.289625 -0.244406 -0.192214 -0.376274 -0.187632 -0.546065 0.140439 0.097977 0.090875 0.470604 0.134981 0.180741 0.268944 -0.642493 -0.798163 -0.439293 -0.379236 -0.225486 -0.228169 -0.239346 -0.360618 -0.328147 0.401421 -0.778964 -0.788900 0.233030 0.256129 0.252081 0.243334 0.254389 0.232403 0.238986 0.233720 0.256208 0.227074 0.225805 0.228974 0.214637 0.213785 0.353205 0.235091 0.219352 0.224839 0.234589 0.226614 0.227048 0.227761
chargesum: 0.00000
title: Mulliken charges with hydrogens summed into heavy atoms:
elementType: O O O O C C C C C C C C C C C C C C C C C C C C C
charge: -0.289625 -0.244406 -0.192214 -0.023070 0.045398 -0.037855 0.140439 0.097977 0.090875 0.470604 0.134981 0.180741 0.268944 -0.399159 -0.072384 -0.205574 -0.123029 0.001588 -0.002364 -0.010372 0.067804 -0.093056 0.401421 -0.100184 -0.107477
polarizability: 3.71304992e+02 1.00388928e+00 2.45993907e+02 -1.79439952e+00 1.43813756e+01 1.64564732e+02
1716.lowfreq: -7.9990 -5.0441 -0.0004 0.0004 0.0009 4.7606 13.0983 21.0942 23.2235
frequency: 12.5889 21.0353 23.2145 30.3575 34.2347 43.7853 64.4599 68.7070 83.4610 107.0620 117.1830 126.7633 152.1719 174.2424 182.6212 206.7123 222.9484 237.7070 252.8748 280.4947 293.9924 307.3783 320.6003 337.0156 367.4605 376.8219 397.1585 401.3489 414.4081 440.0616 452.7537 460.3867 485.7496 501.8154 530.5588 565.2747 583.6902 599.1398 607.5314 615.6456 643.9221 651.1886 673.8840 697.1572 706.2015 750.1116 770.6794 783.3591 804.4963 813.5271 846.1036 856.1901 869.1761 888.4218 915.0572 925.1856 947.7639 957.0690 979.5361 980.0224 987.7336 990.4018 991.8096 997.5877 1025.0853 1032.3979 1044.2543 1046.4166 1056.4504 1082.0139 1083.6092 1085.7965 1119.8775 1140.9128 1169.1335 1173.0774 1177.0174 1187.4328 1189.1612 1218.7979 1227.4403 1242.9853 1247.9602 1280.4977 1302.0346 1313.3773 1320.8326 1342.0786 1350.5141 1371.7530 1377.3047 1387.0238 1389.2823 1398.8708 1400.5664 1410.6187 1427.4578 1441.8685 1453.9374 1459.0312 1463.2958 1471.2329 1471.7743 1476.9210 1484.2731 1485.0757 1495.7797 1570.9774 1593.8997 1596.3811 1613.9314 1616.5158 1697.7586 2957.9886 2964.8113 2968.8201 2972.3735 2986.3343 2995.6311 3032.3534 3038.3414 3043.3823 3065.4760 3083.3509 3087.5790 3097.7885 3114.6994 3116.1783 3119.4082 3127.4594 3140.7336 3146.3544 3154.5375 3166.3429 3537.7833
redmass: 3.1174 3.4817 2.0363 1.7225 3.5160 3.8365 5.5619 3.8672 4.1303 4.1172 1.0716 3.6628 2.3407 4.3740 1.6467 4.5009 6.0912 3.6654 3.9366 4.9007 4.8844 2.5388 3.4688 3.7764 4.4155 2.8093 1.2255 2.8325 3.8122 5.1576 4.5328 2.8079 4.2171 3.3870 2.8765 4.3431 4.6885 3.3131 5.6440 6.2126 4.2557 6.4506 5.2408 4.2469 1.7714 2.2653 1.8753 2.7988 3.2253 2.9758 2.7670 1.2545 2.5683 3.4719 4.8145 1.4759 1.3926 3.1599 1.3959 1.6608 2.3592 5.7240 1.2725 1.3195 2.4348 4.3371 1.6950 1.4883 2.8543 1.8508 1.7033 2.5328 4.4417 2.3727 1.3326 1.0546 1.5905 1.1111 1.3560 1.9323 1.9524 1.7027 1.4624 3.4345 1.6803 1.9055 1.5576 1.6211 1.6919 4.0560 1.7587 6.2078 1.3053 1.3704 1.2295 2.9092 1.1002 2.1391 1.0509 1.0785 1.0795 1.0502 1.1060 1.2032 1.2791 2.0190 2.4150 8.9276 6.6834 6.9009 7.8642 6.1302 6.3335 1.0595 1.0374 1.0836 1.0390 1.0409 1.0649 1.1014 1.0968 1.0961 1.0928 1.0971 1.0988 1.0959 1.0902 1.0873 1.0994 1.0867 1.0921 1.0901 1.0956 1.1008 1.0656
irintensity: 0.4164 0.1980 0.1252 0.4707 1.8097 0.2384 0.6837 0.1401 4.2372 2.2355 0.4107 3.8696 3.7622 0.4266 0.4663 0.4780 3.5408 1.2787 2.1025 5.6779 6.4888 0.0643 1.3940 2.8584 4.7384 4.1473 99.2149 0.9928 9.0994 7.0483 3.6575 4.2148 21.4811 1.3617 7.8846 11.8125 51.6033 9.5981 10.0511 0.2413 5.5203 1.5172 8.0314 11.7152 45.2124 21.2119 52.7349 11.8534 35.1112 2.3789 5.1830 0.2145 14.4575 10.8849 101.1198 2.0470 0.2216 48.5771 0.9504 4.7461 53.7970 0.3326 3.6019 1.5168 50.3888 123.3814 22.9008 5.7050 5.3812 87.6076 4.4527 354.4292 349.1150 2.1318 21.3058 0.6879 21.5264 2.0175 4.5601 4.5923 79.3104 15.7085 34.8197 180.5644 142.9200 39.4636 20.2994 20.6869 55.3508 171.2448 14.5437 1.2850 26.6723 26.8616 19.0548 25.5574 12.3032 10.3758 2.0829 1.8630 17.6260 27.6017 16.3224 14.6221 32.8389 8.1728 1.1145 211.3163 220.0967 269.6619 311.8788 14.8993 29.2805 31.8856 32.7386 20.7880 41.8780 25.2853 10.2985 25.2968 7.7605 35.8522 16.1349 9.1212 23.6997 34.2229 25.3261 7.5863 6.4396 0.2592 24.1142 12.8420 34.3375 17.4498 22.6981
temp: 298.150 k
press: 1.00000 atm
elementType: 8 8 8 8 6 6 6 6 6 6 6 6 6 6 6 6 6 6 6 6 6 6 6 6 6 1 1 1 1 1 1 1 1 1 1 1 1 1 1 1 1 1 1 1 1 1 1
symmnumber: 1
zpe: 986084.3 jmol-1
zpe.correction: 0.375580 hartree
zpe.thermalcorrener: 0.400322 hartree
zpe.thermalcorrenthalpy: 0.401266 hartree
zpe.thermalcorrgfe: 0.316932 hartree
zpe.sumelectzpe: -1112.486532 hartree
zpe.sumelectthermal: -1112.461790 hartree
zpe.sumelectthermalent: -1112.460846 hartree
zpe.sumelectthermalfe: -1112.545179 hartree
dipole: 4.9564 -2.6539 0.4459
dipole: 5.6399
quadrupole: -104.8860 -160.9678 -141.8136
quadrupole: 16.4232 -0.3549 2.5003
quadrupole: 31.0031 -25.0787 -5.9245 16.4232 -0.3549 2.5003
hfenergy: -1112.8621114 hartree
pointgroup: C01 [X(C21H22O4)]
dipole: 1.9003802 -1.1411729 0.0989746 debye
polarizability: 370.709632|-5.7111242|239.3322309|9.6236637|26.5077525|171.8217681 unknown
InChI: InChI=1S/C21H22O4/c1-13(2)9-10-24-18-11-16(22)20-17(23)12-19(25-21(20)14(18)3)15-7-5-4-6-8-15/h4-9,11,19,22H,10,12H2,1-3H3
charge 0 multiplicity 1
47 atoms
O  -1.653733 -0.487972 -0.154775
O  3.086656 -0.711958 -0.220537
O  -1.79855 3.645583 0.513335
O  0.924132 3.600643 0.688806
C  -2.866624 0.160164 0.423127
C  -2.95058 1.600295 -0.1074
C  -0.449524 0.219368 -0.018181
C  -0.431235 1.635786 0.253441
C  -1.69657 2.40864 0.264552
C  -4.061613 -0.695594 0.052968
C  0.715625 -0.56306 -0.18333
C  0.857477 2.235423 0.402239
C  1.964801 0.104647 -0.052623
C  2.043235 1.486581 0.248555
C  0.656687 -2.04831 -0.468523
C  -5.130549 -0.843486 0.970053
C  -4.152472 -1.306832 -1.22235
C  -6.282759 -1.580368 0.615121
C  -5.299278 -2.052064 -1.573505
C  -6.370368 -2.187099 -0.658931
C  4.43611 -0.087781 -0.086979
C  5.453384 -1.144131 -0.404167
C  6.410674 -1.638542 0.433407
C  7.389198 -2.692779 -0.056207
C  6.609663 -1.21641 1.878155
H  -2.735495 0.180844 1.525806
H  -3.835571 2.119679 0.297383
H  -3.052558 1.574084 -1.210835
H  3.010705 1.985232 0.368209
H  -0.345136 -2.443861 -0.243163
H  0.877414 -2.259291 -1.532463
H  1.413387 -2.589089 0.124942
H  -5.062617 -0.384075 1.964343
H  -3.314212 -1.214618 -1.920641
H  -7.104311 -1.687619 1.332147
H  -5.358394 -2.528522 -2.558622
H  -7.26046 -2.764063 -0.933847
H  4.498021 0.74846 -0.814656
H  4.546827 0.320506 0.935175
H  1.87076 3.895246 0.721276
H  5.395781 -1.538554 -1.427677
H  8.435514 -2.346077 0.055669
H  7.297227 -3.619223 0.544151
H  7.222958 -2.951101 -1.115651
H  7.588629 -0.713652 2.006456
H  5.827739 -0.536287 2.25247
H  6.624507 -2.107661 2.534777
