program: Gaussian 09
title: 000179727
version: EM64L-G09RevD.01
frameworkgroup: C1[X(C9H18N4OS)]
method: RPBEPBE
basis: SDD
operation: Freq
keyword: #p
keyword: freq=noraman
keyword: PBEPBE/SDD
title: #p freq=noraman PBEPBE/SDD
converged: YES YES NO NO
title: Mulliken charges:
elementType: S O N N N N C C C C C C C C C H H H H H H H H H H H H H H H H H H
charge: 0.280568 -0.243632 -0.390924 -0.180733 -0.023312 -0.502658 -0.006119 -0.249823 -0.412678 -0.388398 0.194583 -0.717520 -0.716988 -0.158831 -0.828249 0.216616 0.261452 0.221361 0.183172 0.228314 0.204308 0.295854 0.219921 0.220840 0.220107 0.211617 0.218603 0.216336 0.319986 0.313556 0.279925 0.274550 0.238195
chargesum: 0.00000
title: Mulliken charges with hydrogens summed into heavy atoms:
elementType: S O N N N N C C C C C C C C C
charge: 0.280568 -0.243632 -0.095070 -0.180733 -0.023312 0.130885 0.210497 0.011629 -0.008145 0.044224 0.194583 -0.056653 -0.070431 -0.158831 -0.035579
polarizability: 1.98063107e+02 -5.31387002e+00 1.46052613e+02 -2.83512172e+00 8.93361816e+00 1.06898889e+02
1716.lowfreq: -12.3761 -10.5061 -3.1408 0.0013 0.0014 0.0022 26.6707 34.5881 51.2075
frequency: 26.2567 34.1923 51.1986 70.4859 97.5863 105.0452 125.8748 137.6287 161.7313 184.1112 192.0658 203.8594 223.4335 237.0873 250.5268 260.8855 278.2818 300.1876 339.1159 380.5117 396.9129 438.1302 468.3896 478.8792 563.7570 587.3279 591.8225 642.5507 649.6452 654.6801 747.2183 765.5836 773.6446 803.8625 836.9557 907.6490 933.7970 967.5068 978.1893 989.4250 1001.6352 1017.0256 1047.8575 1058.1762 1063.2793 1096.6323 1140.8163 1147.7982 1168.8563 1228.3576 1237.6371 1253.5602 1278.1558 1286.8588 1291.7570 1300.5291 1315.6781 1323.4559 1340.0314 1342.1462 1358.9280 1392.2002 1395.1918 1432.0546 1438.4729 1452.1577 1463.5524 1476.1447 1479.4796 1483.9071 1488.3349 1493.5878 1566.1022 1608.1231 1668.2321 2846.5326 2957.5198 2976.6564 2977.1185 2983.3194 2993.9804 3020.4425 3029.3376 3042.5178 3070.4130 3072.3084 3073.4532 3077.8976 3145.8141 3150.5693 3400.1911 3517.3716 3523.5028
redmass: 2.5913 3.1822 3.8619 4.1772 2.1246 3.0606 2.3668 1.1750 3.5784 2.3633 2.9340 1.6623 1.9288 1.4982 1.6521 2.4619 3.5908 5.3225 4.3309 3.0711 4.1062 3.1113 4.5729 5.6718 7.0185 4.0904 5.2465 2.6409 2.8894 4.5919 1.5587 1.4226 2.3614 2.1278 1.6831 3.3863 2.3856 2.1017 1.1829 1.3942 1.4289 1.7787 3.1193 2.4762 3.2306 2.4615 2.7695 2.4886 2.2933 2.6994 1.3418 1.2755 1.2919 3.8059 1.4289 1.4597 1.3495 1.4118 1.1783 1.4574 1.4914 1.2087 1.2060 1.0523 1.3312 1.0566 1.0752 1.0631 1.0507 1.0676 1.0501 1.0687 5.6691 11.7497 1.0844 1.0782 1.0678 1.0365 1.0358 1.0748 1.0673 1.0280 1.0940 1.0995 1.0998 1.0992 1.0990 1.0998 1.1043 1.1054 1.0430 1.0773 1.0995
irintensity: 0.1702 0.3335 0.0616 0.5176 2.4036 12.2296 1.8097 3.4669 1.6872 0.3500 4.4227 22.9605 27.4785 0.7347 2.6673 3.9362 1.1230 2.1023 24.7464 0.8375 1.0632 1.9836 6.1549 0.7612 15.5697 12.5570 9.0588 21.9554 54.7690 22.9898 8.4801 102.8450 21.5908 15.2829 6.8447 30.4140 15.9552 11.6922 8.9315 19.1112 8.2736 5.9522 4.2026 2.1315 25.7130 6.7626 22.4082 2.5151 2.1269 178.0223 1.3445 4.5211 12.0021 39.4143 17.4941 64.0396 5.2007 40.7386 2.1277 2.9763 10.4803 13.2073 13.2543 14.0063 2.0124 21.2753 3.5372 9.3034 13.3375 6.8032 10.8108 16.6201 60.9969 225.5851 38.2206 54.8195 25.6176 28.2025 38.9485 4.5363 35.0375 24.8305 17.9430 3.1112 49.8798 62.6601 35.3239 72.5331 10.8342 12.4130 5.3791 7.3677 10.5644
temp: 298.150 k
press: 1.00000 atm
elementType: 16 8 7 7 7 7 6 6 6 6 6 6 6 6 6 1 1 1 1 1 1 1 1 1 1 1 1 1 1 1 1 1 1
symmnumber: 1
zpe: 716752.4 jmol-1
zpe.correction: 0.272997 hartree
zpe.thermalcorrener: 0.291007 hartree
zpe.thermalcorrenthalpy: 0.291951 hartree
zpe.thermalcorrgfe: 0.226178 hartree
zpe.sumelectzpe: -1044.792150 hartree
zpe.sumelectthermal: -1044.774140 hartree
zpe.sumelectthermalent: -1044.773196 hartree
zpe.sumelectthermalfe: -1044.838969 hartree
dipole: -0.8942 -1.6020 -0.1932
dipole: 1.8448
quadrupole: -97.2071 -94.6427 -99.7639
quadrupole: 3.6937 -0.6898 -1.8232
quadrupole: -0.0025 2.5619 -2.5593 3.6937 -0.6898 -1.8232
hfenergy: -1045.065147 hartree
pointgroup: C01 [X(C9H18N4O1S1)]
dipole: -0.3726953 0.6163316 0.0895566 debye
polarizability: 197.533756|6.5576681|145.7457276|4.7262347|10.5109982|107.7351253 unknown
InChI: InChI=1S/C9H18N4OS/c1-4-6(5-2)7-8(14)13(10)9(15-3)12-11-7/h6-7,11H,4-5,10H2,1-3H3
charge 0 multiplicity 1
33 atoms
S  3.948573 0.143242 0.217693
O  -0.369263 -2.220052 -0.924117
N  0.027993 0.889734 0.855124
N  1.514644 -1.094035 -0.148343
N  1.429406 1.1126 0.796995
N  2.365447 -2.202692 -0.421195
C  -2.125476 -0.022012 -0.073581
C  -0.599715 0.173392 -0.283255
C  -2.895158 1.329032 -0.149611
C  -2.435974 -0.793174 1.239907
C  0.142504 -1.163215 -0.458199
C  -2.662262 2.151946 -1.437127
C  -3.906243 -1.252378 1.356545
C  2.12512 0.115107 0.302801
C  4.20387 1.876275 0.915126
H  -2.455671 -0.655072 -0.923167
H  -0.446719 0.731421 -1.242392
H  -3.974951 1.104083 -0.068577
H  -2.656184 1.95024 0.74033
H  -1.784951 -1.686075 1.283676
H  -2.16517 -0.165174 2.110895
H  -0.448377 1.751748 1.132375
H  -2.846216 1.537412 -2.338442
H  -3.347551 3.018318 -1.475617
H  -1.632077 2.548163 -1.504437
H  -4.607798 -0.401134 1.427666
H  -4.049448 -1.87208 2.260601
H  -4.199056 -1.863048 0.48151
H  2.09836 -2.631769 -1.318044
H  2.328131 -2.887951 0.346744
H  3.793209 1.931513 1.932925
H  3.703648 2.615146 0.273171
H  5.294556 2.028985 0.919022
