program: Gaussian 09
title: 000179711
version: EM64L-G09RevD.01
frameworkgroup: C1[X(C15H13NO5)]
method: RPBEPBE
basis: SDD
operation: Freq
keyword: #p
keyword: freq=noraman
keyword: PBEPBE/SDD
title: #p freq=noraman PBEPBE/SDD
converged: YES YES NO NO
title: Mulliken charges:
elementType: O O O O O N C C C C C C C C C C C C C C C H H H H H H H H H H H H H
charge: -0.250089 -0.487964 -0.285367 -0.448244 -0.306703 -0.509791 0.365352 0.031091 -0.477329 0.084631 0.352627 -0.295262 0.145445 -0.379316 0.239619 -0.296044 0.125212 -0.388537 -0.257002 -0.195813 -0.535438 0.344992 0.472948 0.276030 0.246405 0.283651 0.221525 0.233719 0.231373 0.223993 0.223816 0.249759 0.379614 0.381097
chargesum: 0.00000
title: Mulliken charges with hydrogens summed into heavy atoms:
elementType: O O O O O N C C C C C C C C C C C C C C C
charge: -0.250089 -0.108350 -0.285367 -0.067147 -0.306703 -0.036844 0.365352 0.031091 -0.132337 0.084631 0.352627 -0.019233 0.145445 -0.132912 0.239619 -0.012394 0.125212 -0.167012 -0.023283 0.035561 0.162130
polarizability: 3.22088452e+02 9.25213010e+00 2.32064759e+02 -2.46174058e+00 2.75595038e+00 7.82463415e+01
1716.lowfreq: -0.0006 0.0004 0.0006 1.0718 4.1476 7.3227 14.1808 30.4114 58.7251
frequency: 13.8205 30.4065 58.7187 76.5166 89.6813 97.0089 121.5174 148.1947 157.3789 173.4337 215.8712 234.6002 238.4419 281.6516 295.2168 305.6380 333.1551 336.0785 338.9889 378.1410 436.4819 456.4841 459.0872 511.8108 524.8576 528.7629 546.5773 559.8297 572.6604 591.0292 631.7599 651.7651 680.0153 683.1861 688.1001 744.7307 755.4406 765.0108 771.2208 811.0758 815.7157 857.5389 869.7881 917.0963 941.7315 960.5185 963.5054 968.2560 994.2387 1001.0379 1017.6576 1032.1889 1060.0096 1079.4629 1110.7003 1123.6637 1139.3370 1148.4127 1169.6992 1170.6983 1197.6950 1222.1458 1245.8978 1259.7229 1286.4284 1289.8665 1319.9329 1391.5909 1394.1518 1425.5903 1435.8565 1440.7984 1468.3300 1468.4047 1471.3601 1486.2904 1512.7376 1549.8720 1576.5951 1606.8363 1611.5512 1619.8215 1643.6599 2966.1393 3057.2886 3119.9592 3130.5808 3142.5214 3157.4477 3164.0456 3172.8667 3185.6371 3199.9095 3216.0862 3537.0303 3625.2537
redmass: 6.1947 6.1981 10.7906 3.9337 5.4270 4.3101 5.8929 5.9301 5.6592 7.0844 1.1606 4.8702 5.1558 4.9816 5.5274 4.3424 5.6714 1.3600 4.4631 6.2907 3.4801 2.9365 5.9879 5.6037 4.9431 3.9722 6.0269 1.2074 5.9074 5.5834 5.0052 6.2228 4.2988 3.9374 5.2819 6.3084 2.2397 3.7956 1.9638 6.3587 1.6357 1.4567 6.9763 6.5228 1.4099 1.3502 1.1388 1.3431 5.2215 1.3348 3.5019 2.6262 2.2429 2.2272 1.2590 1.7035 1.3464 1.4610 1.1657 1.4957 1.8063 2.5814 2.8479 2.1915 1.5724 2.0372 2.7040 8.9143 7.7750 2.2202 2.5641 1.6250 1.5875 1.0937 1.4145 2.8745 2.5099 8.4125 4.0464 6.7206 6.9254 5.6851 3.8871 1.0327 1.1042 1.0883 1.0999 1.0890 1.0933 1.0878 1.0997 1.0963 1.0922 1.0832 1.0641 1.0669
irintensity: 0.1349 7.5399 0.2714 1.1702 2.6929 1.5823 0.3738 2.6844 1.0104 3.4806 0.2374 3.0692 0.6421 2.5479 6.3623 3.2022 7.7835 104.4933 14.5111 11.6969 0.7395 35.3238 13.3263 4.5762 33.1919 17.9353 22.8631 108.7787 24.8185 12.2812 4.6595 3.2935 10.3777 51.3283 5.9209 9.9019 56.0098 3.2864 39.3436 6.1381 29.5227 0.2751 14.4982 13.6065 33.4488 2.6078 127.6947 0.8104 273.1046 1.0290 108.6820 31.8230 53.8934 141.3958 0.3042 133.3928 54.5715 10.2566 62.4380 73.6315 80.3827 23.3832 198.9026 16.3903 94.3796 120.4600 196.8607 15.0490 13.8368 65.0383 63.8952 45.2746 117.7749 21.6528 23.1979 49.2415 733.0471 267.1033 265.5896 136.9631 24.0632 124.8251 256.0328 77.9146 44.2252 7.7584 21.0486 11.2999 6.9859 5.5056 28.1001 5.3536 29.1192 169.1840 54.6345 58.5739
temp: 298.150 k
press: 1.00000 atm
elementType: 8 8 8 8 8 7 6 6 6 6 6 6 6 6 6 6 6 6 6 6 6 1 1 1 1 1 1 1 1 1 1 1 1 1
symmnumber: 1
zpe: 665336.1 jmol-1
zpe.correction: 0.253413 hartree
zpe.thermalcorrener: 0.272121 hartree
zpe.thermalcorrenthalpy: 0.273065 hartree
zpe.thermalcorrgfe: 0.205010 hartree
zpe.sumelectzpe: -1008.797470 hartree
zpe.sumelectthermal: -1008.778762 hartree
zpe.sumelectthermalent: -1008.777818 hartree
zpe.sumelectthermalfe: -1008.845873 hartree
dipole: -0.3197 3.2889 -0.0815
dipole: 3.3054
quadrupole: -75.4518 -110.8718 -126.2375
quadrupole: 10.4361 -0.2053 0.8920
quadrupole: 28.7353 -6.6847 -22.0505 10.4361 -0.2053 0.8920
hfenergy: -1009.0508827 hartree
pointgroup: C01 [X(C15H13N1O5)]
dipole: -0.1390396 -1.1944692 -0.4950888 debye
polarizability: 321.2934194|-14.3452436|205.793851|7.3302996|57.9902675|105.3122827 unknown
InChI: InChI=1S/C15H13NO5/c1-21-9-6-7-10(15(19)20)12(8-9)16-14(18)11-4-2-3-5-13(11)17/h2-8,16-17,19H,1H3
charge 0 multiplicity 1
34 atoms
O  -3.879688 2.255962 0.750657
O  2.405782 -1.470464 -0.900165
O  0.67466 1.935217 0.897474
O  -2.2120 -3.477502 -1.462219
O  -0.05727 -2.723791 -1.104209
N  0.225911 -0.158598 -0.083657
C  -1.187508 -0.108741 -0.106506
C  -1.943895 -1.24973 -0.589988
C  -1.902883 1.033793 0.330142
C  2.575963 0.569518 0.360256
C  -3.313887 1.065327 0.291341
C  -3.36278 -1.176054 -0.612358
C  1.086892 0.835874 0.403659
C  -4.065242 -0.042905 -0.183294
C  3.223772 -0.543531 -0.246564
C  3.400429 1.534353 0.998854
C  -1.299598 -2.48551 -1.050192
C  4.629692 -0.692223 -0.206604
C  4.800729 1.400368 1.047458
C  5.417933 0.278361 0.444357
C  -5.342295 2.370879 0.744683
H  -1.358256 1.900374 0.704292
H  0.666298 -1.017708 -0.473834
H  -3.908917 -2.047892 -0.980702
H  -5.157402 -0.030218 -0.218233
H  2.891375 2.389701 1.454229
H  5.100829 -1.559505 -0.686483
H  5.40736 2.159491 1.550889
H  6.506502 0.160114 0.475132
H  -5.807024 1.607466 1.397541
H  -5.747581 2.283431 -0.281527
H  -5.549292 3.375085 1.141579
H  2.871752 -2.287311 -1.196603
H  -1.68606 -4.269131 -1.753704
