program: Gaussian 09
title: 000179723
version: EM64L-G09RevD.01
frameworkgroup: C1[X(C15H22N4OS)]
method: RPBEPBE
basis: SDD
operation: Freq
keyword: #p
keyword: freq=noraman
keyword: PBEPBE/SDD
title: #p freq=noraman PBEPBE/SDD
converged: NO YES NO NO
title: Mulliken charges:
elementType: S O N N N N C C C C C C C C C C C C C C C H H H H H H H H H H H H H H H H H H H H H H
charge: 0.279440 -0.233863 -0.209357 -0.142502 0.048345 -0.497152 0.334349 -0.201397 -0.748936 -0.731017 -0.714812 0.101364 -0.483944 -0.218766 0.458662 -0.406897 -0.347855 -0.228217 -0.259202 -0.241552 -0.825686 0.240580 0.254637 0.219771 0.201802 0.220198 0.232007 0.213963 0.215270 0.205883 0.235867 0.229328 0.228060 0.315240 0.316064 0.225869 0.243611 0.224944 0.224933 0.227587 0.281171 0.274950 0.237258
chargesum: 0.00000
title: Mulliken charges with hydrogens summed into heavy atoms:
elementType: S O N N N N C C C C C C C C C C C C C C C
charge: 0.279440 -0.233863 -0.209357 -0.142502 0.048345 0.134153 0.334349 0.039183 -0.072727 -0.064848 -0.057792 0.101364 -0.026555 -0.218766 0.458662 -0.181027 -0.104244 -0.003273 -0.034269 -0.013965 -0.032307
polarizability: 2.61648473e+02 9.48542959e+00 2.03759059e+02 6.84685057e+00 1.59036842e+01 1.71012647e+02
1716.lowfreq: -9.2412 0.0009 0.0015 0.0017 3.1672 9.1814 14.9953 28.4363 38.9223
frequency: 11.8980 28.4083 38.8502 51.7916 66.2332 72.4864 97.8082 123.2125 138.8953 146.0213 150.0968 190.9203 193.1828 201.2269 211.5168 231.4988 239.6065 253.7642 255.1573 268.0789 280.7891 294.1366 302.9195 325.1478 333.3917 375.0772 397.2453 403.1425 430.9664 442.0478 459.9614 487.2245 542.0866 564.6381 604.0933 617.4700 623.7751 651.0024 681.8761 700.0538 733.5069 737.6873 771.0806 792.5787 810.0558 846.8049 851.2390 887.2103 901.0514 925.4500 927.3594 932.1185 941.8928 974.2973 974.4153 979.1389 990.2471 991.9355 995.6641 1016.7492 1026.3467 1027.9038 1077.8163 1093.4767 1106.0183 1168.9398 1171.3980 1184.5461 1190.4646 1208.5301 1221.2483 1231.4803 1250.1564 1269.6895 1283.0396 1289.7510 1305.2379 1310.6768 1331.8475 1342.5993 1363.8899 1370.5785 1379.9688 1392.9150 1406.6844 1431.3198 1441.0404 1449.7909 1455.4497 1456.8222 1463.1943 1470.0447 1480.6339 1483.1268 1486.0127 1496.8570 1555.5662 1595.5494 1598.7890 1616.4910 1667.0989 2920.7936 2970.5581 2976.6170 2980.8991 2995.8513 3020.1728 3026.5675 3060.6069 3068.8074 3072.6440 3079.2673 3086.3547 3089.6778 3108.5704 3124.0422 3137.8112 3144.4500 3150.6273 3154.5752 3165.8815 3400.6344 3526.8760
redmass: 4.4208 4.2641 3.3221 4.5010 4.0888 3.2598 3.1826 1.9935 1.5866 3.8621 3.4502 1.6589 1.3426 2.5319 2.0163 4.4067 1.7139 2.1330 1.9899 1.7356 3.0668 2.1884 2.9535 3.7453 4.6362 2.4722 2.9903 2.8196 3.6068 4.5628 3.0151 5.5333 4.5754 10.0063 7.3585 6.4748 5.5314 7.1335 5.4988 2.3055 1.7607 1.8858 3.4847 3.9381 3.1753 4.2243 1.2498 2.8061 1.3857 2.6890 1.7963 1.9702 1.2361 1.3810 1.2030 1.9404 3.0260 1.6150 1.4408 1.4901 2.1394 1.4690 1.8670 3.8951 3.2209 2.1146 1.1206 1.1169 2.0855 2.4515 2.6052 3.0889 2.8641 1.2721 1.6403 3.4462 1.9447 1.7378 1.4140 1.1741 1.7619 1.2171 1.2058 3.3503 1.2078 1.0519 2.1339 1.0567 1.0885 1.0564 1.0561 1.0607 1.0683 1.4336 1.4050 1.0644 10.0258 6.1657 9.8857 6.0451 1.0897 1.0689 1.0366 1.0354 1.0368 1.0848 1.0283 1.0894 1.0985 1.0997 1.0987 1.0996 1.0983 1.0984 1.0877 1.0862 1.0923 1.1041 1.1052 1.0956 1.0993 1.0437 1.0988
irintensity: 0.0562 0.2639 0.2540 0.5422 0.5887 1.4071 15.9707 0.2214 5.3086 1.8017 6.8970 1.8732 28.7419 7.3952 0.7192 3.1198 3.6512 1.5580 6.4527 3.8158 0.8998 1.0888 6.1644 13.0913 10.6751 1.0608 0.1156 0.1635 0.3775 4.9228 6.6033 6.0035 3.6545 0.3626 0.3837 0.7115 6.4348 0.1116 1.3639 27.5574 2.2194 128.4582 16.7721 4.8003 66.3834 7.9824 0.1155 8.5130 0.5373 11.4594 16.5280 11.4798 0.0144 0.8386 7.7234 31.0086 1.1584 7.6102 4.8759 1.2522 18.0991 1.5339 17.7870 44.9529 29.3723 25.8184 4.2226 4.5920 32.0613 18.1927 27.3920 22.7100 79.6961 8.5079 30.8127 34.8725 27.0729 41.4164 19.9996 1.5050 0.2500 21.4226 19.0963 4.6611 23.4495 14.6977 13.9562 18.4819 12.2785 4.3443 0.4567 10.1915 10.1944 12.9327 14.7945 25.2086 65.7126 8.5024 235.0839 7.3533 46.3000 67.4553 29.9830 25.4667 29.9601 13.1584 20.8474 16.7060 11.6954 8.6593 64.1919 16.9069 34.7589 33.8553 10.1036 0.0210 26.2445 12.9860 11.9146 46.8455 11.0590 5.2220 8.2283
temp: 298.150 k
press: 1.00000 atm
elementType: 16 8 7 7 7 7 6 6 6 6 6 6 6 6 6 6 6 6 6 6 6 1 1 1 1 1 1 1 1 1 1 1 1 1 1 1 1 1 1 1 1 1 1
symmnumber: 1
zpe: 920427.5 jmol-1
zpe.correction: 0.350572 hartree
zpe.thermalcorrener: 0.373419 hartree
zpe.thermalcorrenthalpy: 0.374363 hartree
zpe.thermalcorrgfe: 0.297350 hartree
zpe.sumelectzpe: -1275.429599 hartree
zpe.sumelectthermal: -1275.406752 hartree
zpe.sumelectthermalent: -1275.405808 hartree
zpe.sumelectthermalfe: -1275.482821 hartree
dipole: 1.2689 -0.5300 0.2448
dipole: 1.3968
quadrupole: -130.8882 -135.5784 -127.7639
quadrupole: -0.4052 -3.7021 -1.4268
quadrupole: 0.5220 -4.1682 3.6463 -0.4052 -3.7021 -1.4268
hfenergy: -1275.7801709 hartree
pointgroup: C01 [X(C15H22N4O1S1)]
dipole: -0.432491 0.3291455 0.0812593 debye
polarizability: 260.4941111|-7.6889169|197.1971146|-16.9129792|-17.667816|178.7289534 unknown
InChI: InChI=1S/C15H22N4OS/c1-15(2,3)12-13(20)19(16)14(21-4)17-18(12)10-11-8-6-5-7-9-11/h5-9,12H,10,16H2,1-4H3
charge 0 multiplicity 1
43 atoms
S  1.155063 -3.560065 1.152073
O  3.736932 -0.209022 -1.637419
N  0.314222 0.077806 -0.426497
N  2.495165 -1.611139 -0.2558
N  0.164611 -1.189322 0.16487
N  3.476507 -2.641977 -0.316368
C  2.072724 1.710132 0.489339
C  1.655377 0.69643 -0.657411
C  1.019566 2.849123 0.527232
C  2.117432 0.997461 1.864036
C  3.460808 2.322687 0.163153
C  2.714901 -0.385034 -0.911871
C  -0.855124 0.509169 -1.209439
C  1.22433 -1.948418 0.293734
C  -2.172727 0.573576 -0.433876
C  -3.384969 0.601445 -1.168322
C  -2.227046 0.653845 0.977444
C  -4.627678 0.726036 -0.508757
C  -3.468869 0.77474 1.64048
C  -4.673852 0.815008 0.90202
C  -0.650487 -3.484133 1.688285
H  1.614164 1.28238 -1.597152
H  0.009079 2.464592 0.748618
H  1.284566 3.57783 1.315504
H  0.985426 3.396556 -0.43489
H  2.883063 0.200173 1.887511
H  1.140586 0.545222 2.111521
H  2.368361 1.72439 2.658372
H  3.46957 2.79418 -0.837147
H  3.707062 3.099208 0.911329
H  4.262745 1.565218 0.176172
H  -1.003214 -0.144041 -2.0983
H  -0.622867 1.522912 -1.58601
H  3.582029 -2.987602 -1.281461
H  4.371986 -2.295781 0.052136
H  -3.35756 0.522936 -2.263221
H  -1.296801 0.598024 1.550935
H  -5.555442 0.747906 -1.091766
H  -3.496529 0.83136 2.734792
H  -5.6359 0.907458 1.418436
H  -1.303385 -3.445462 0.805404
H  -0.82095 -2.593062 2.309236
H  -0.819974 -4.407349 2.264673
