program: Gaussian 09
title: 000016073
version: EM64L-G09RevD.01
frameworkgroup: C1[X(C11H10ClNO2)]
method: RPBEPBE
basis: SDD
operation: Freq
keyword: #p
keyword: freq=noraman
keyword: PBEPBE/SDD
title: #p freq=noraman PBEPBE/SDD
converged: YES YES NO NO
title: Mulliken charges:
elementType: Cl O O N C C C C C C C C C C C H H H H H H H H H H
charge: -0.064992 -0.317516 -0.265928 -0.466371 0.514314 -0.095213 -0.435068 -0.368399 -0.042247 -0.186523 -0.256625 0.272154 -0.680167 0.253084 -0.491940 0.267247 0.253578 0.304607 0.337380 0.233776 0.258265 0.225901 0.236055 0.233239 0.281389
chargesum: 0.00000
title: Mulliken charges with hydrogens summed into heavy atoms:
elementType: Cl O O N C C C C C C C C C C C
charge: -0.064992 -0.317516 -0.265928 -0.128991 0.514314 0.172034 -0.181490 -0.063792 -0.042247 0.047253 0.001640 0.272154 0.015028 0.253084 -0.210551
polarizability: 2.16920702e+02 -2.70505969e+00 1.27857008e+02 -4.93187517e+00 -1.11524820e+00 9.15891866e+01
1716.lowfreq: -6.7351 -3.0351 -0.0008 0.0018 0.0027 1.0360 18.8797 27.8900 64.7414
frequency: 18.7543 27.8787 64.7402 75.6754 82.8745 157.6723 182.2039 185.9363 204.2937 220.0751 247.5827 259.3861 299.8072 354.9284 374.8206 409.1454 438.0980 518.6061 527.1096 560.5462 605.9911 635.8839 645.6907 661.8907 678.6877 684.3801 701.0836 722.1700 789.3206 798.6936 860.5062 862.8720 873.5669 909.2945 978.8726 987.1044 988.1449 1022.1135 1073.7319 1089.1188 1098.5826 1129.1652 1159.2591 1180.7529 1250.2077 1287.7484 1309.0251 1330.7003 1375.5102 1391.3100 1413.8059 1462.2607 1473.0691 1475.2217 1515.3092 1586.8098 1614.0016 1670.1227 2142.8744 3003.8188 3016.3764 3106.4888 3115.4163 3147.0513 3148.1997 3180.1046 3195.7035 3426.0486 3541.9895
redmass: 4.3928 5.9819 10.0564 5.7283 5.3279 4.2286 5.4756 5.0241 1.4692 3.3754 3.5363 3.5123 6.6723 5.8171 4.4231 8.5509 3.0458 5.5437 5.3821 4.2183 6.4020 1.2291 1.4644 7.2024 1.2682 2.3184 4.3974 5.6735 1.3182 3.9470 3.1881 1.6124 4.3669 1.3659 5.8832 7.8767 1.3396 2.1168 2.0627 1.7546 1.5544 2.4058 3.1736 1.0877 1.7238 1.3098 1.5104 1.3046 5.7310 1.2104 3.1387 1.0443 1.0573 2.5384 2.2697 5.0785 6.5034 8.8017 6.0167 1.0350 1.0838 1.1001 1.1015 1.0902 1.0913 1.0952 1.0958 1.1601 1.0762
irintensity: 0.0647 0.0070 5.0959 0.7722 1.1568 4.4811 2.6533 2.3099 0.8666 3.4966 1.9684 3.1973 10.6965 1.3723 5.2439 6.2104 7.4694 28.1905 2.2955 3.6492 2.1626 67.9354 36.9976 11.1109 56.0783 32.9894 48.2274 11.1973 55.3222 54.9604 97.5066 55.5211 1.0792 3.6298 16.3579 233.2256 9.4890 158.4349 33.3124 173.0690 6.4182 14.2549 358.0925 1.3896 10.9549 6.2559 20.2021 30.0992 107.6768 16.8097 84.9979 10.4010 2.7702 102.6934 435.9261 167.1872 162.1944 231.5167 1.2722 15.1933 9.7286 24.0001 18.5102 12.0988 1.8184 2.3775 5.4914 62.7671 33.3787
temp: 298.150 k
press: 1.00000 atm
elementType: 17 8 8 7 6 6 6 6 6 6 6 6 6 6 6 1 1 1 1 1 1 1 1 1 1
symmnumber: 1
zpe: 481653.6 jmol-1
zpe.correction: 0.183452 hartree
zpe.thermalcorrener: 0.198364 hartree
zpe.thermalcorrenthalpy: 0.199308 hartree
zpe.thermalcorrgfe: 0.139076 hartree
zpe.sumelectzpe: -1089.298841 hartree
zpe.sumelectthermal: -1089.283930 hartree
zpe.sumelectthermalent: -1089.282986 hartree
zpe.sumelectthermalfe: -1089.343217 hartree
dipole: -2.0635 -0.9316 -0.2842
dipole: 2.2818
quadrupole: -89.4898 -91.7378 -91.9312
quadrupole: 9.3867 -0.2834 0.7894
quadrupole: 1.5631 -0.6848 -0.8783 9.3867 -0.2834 0.7894
hfenergy: -1089.4822936 hartree
pointgroup: C01 [X(C11H10Cl1N1O2)]
dipole: 0.8266701 0.3450789 0.0587415 debye
dipolederiv: -0.5638632 0.2513697 0.1918492 0.3239791 -0.3170539 -0.1746082 0.2473079 -0.1745166 -0.2040385 -2.2372631 -0.2128753 -0.2532086 -0.6375525 -0.5435817 -0.0454462 -0.1562235 -0.0464653 -0.4174817 -0.8921158 0.0293101 0.0114441 0.1429559 -0.7128042 -0.3071331 0.1880454 -0.25704 -0.5225661 -2.3077166 0.0019668 0.04882 0.1850371 -0.3396735 -0.0278687 0.2972669 -0.0169212 -0.3410633 1.5158431 0.1703458 0.0514043 0.4924261 0.1865017 0.0197464 0.2030662 0.0231924 0.128871 1.3657107 -0.0420623 0.2182556 -0.33321 0.3687403 -0.2346221 -0.1044321 -0.1877151 0.4611868 -0.6129989 0.0217935 0.0306367 0.1831125 -0.1278349 0.0163792 0.1573338 0.0315799 -0.1714064 -0.3443006 -0.0172897 -0.0096945 -0.2912648 -0.1615449 0.0231837 -0.1725584 0.0102572 -0.1636782 0.9087635 -0.3175186 -0.2671303 -0.4828204 0.4736529 0.3571572 -0.3865845 0.3506234 0.2149255 0.2517071 -0.0470057 -0.0555434 0.0819472 0.0859893 0.1302373 0.0172531 0.1376318 -0.0371199 -0.3141122 0.1307566 0.0848069 0.1419294 -0.2641241 -0.0833774 0.1032189 -0.0830658 -0.2109838 3.0596677 0.066346 0.0230985 0.0686743 0.985798 0.5564584 -0.3100197 0.4500567 0.6424689 -0.119404 -0.0185102 -0.0456102 -0.0218399 -0.0124818 0.0596163 0.0183751 0.0738271 0.0276337 -0.2093437 -0.0710752 0.0818551 0.0241637 -0.099909 0.0094236 0.0591283 0.0229929 -0.0784741 -0.3561408 0.0368038 -0.0558413 0.0639628 -0.3194255 0.0352278 -0.1309423 0.0593299 -0.350728 0.0656276 -0.0110512 -0.0607725 0.1156974 0.0239727 -0.0098368 0.0195978 -0.0170833 -0.0065039 0.0784453 -0.0545041 -0.0242567 -0.0545577 0.0243788 -0.0930878 -0.0271531 -0.09183 0.1209138 0.1454459 0.0461603 0.0383919 0.0493458 0.1144674 -0.0421243 0.033405 -0.0471622 0.1525599 0.2010153 0.0174108 0.0350241 -0.0051517 0.2159687 -0.0742824 -0.0005948 -0.0695834 0.2673514 0.0580948 -0.0238978 -0.0083818 -0.0433531 -0.0247857 -0.1106229 -0.019283 -0.1106683 0.0834881 -0.0373902 -0.0430146 -0.0098532 -0.0337665 0.1155618 -0.0363569 -0.0023716 -0.0358675 0.1551012 -0.1349693 0.0364687 0.0438903 0.0443332 0.0651107 -0.0252172 0.0516766 -0.0085626 0.1065857 0.1185806 0.0040168 0.0166193 -0.0389483 0.0007888 -0.0652172 -0.0060451 -0.1215828 -0.0283467 0.088185 0.0346361 -0.0813988 0.023308 0.0120544 0.1070853 -0.0836232 0.0931356 -0.0580264 0.2725318 0.0114195 -0.0044049 0.0015924 0.2502338 0.0152861 0.0041561 0.0154374 0.2293309 unknown
polarizability: 216.5618756|-7.8378063|118.6916545|0.327241|16.1649192|101.1133664 unknown
InChI: InChI=1S/C11H10ClNO2/c1-3-8(2)15-11(14)13-10-6-4-5-9(12)7-10/h1,4-8,13H,2H3
charge 0 multiplicity 1
25 atoms
Cl -5.037894 1.413811 1.1470
O  2.220557 0.809059 0.061765
O  1.285367 -1.078407 -1.015079
N  -0.013332 0.526725 0.156109
C  -1.341974 0.060868 -0.02945
C  3.601617 0.304241 -0.257997
C  -2.383544 0.834865 0.550916
C  -1.653204 -1.121014 -0.753311
C  -3.712133 0.409182 0.394851
C  -3.002609 -1.509782 -0.885682
C  -4.05499 -0.756032 -0.316458
C  1.155205 -0.033839 -0.333067
C  4.433019 1.538377 -0.636674
C  4.13463 -0.426149 0.906126
C  4.602382 -1.038197 1.867918
H  3.499961 -0.393713 -1.111021
H  -2.160313 1.749296 1.110972
H  -0.849313 -1.712253 -1.195134
H  0.118938 1.377558 0.707606
H  -3.242429 -2.421182 -1.443545
H  -5.098725 -1.062763 -0.421309
H  5.465519 1.233538 -0.880161
H  4.466891 2.254971 0.200271
H  3.989084 2.033269 -1.516553
H  5.000992 -1.578829 2.707207
