program: Gaussian 09
title: 000179688
version: EM64L-G09RevD.01
frameworkgroup: C1[X(C15H17NO4S)]
method: RPBEPBE
basis: SDD
operation: Freq
keyword: #p
keyword: freq=noraman
keyword: PBEPBE/SDD
title: #p freq=noraman PBEPBE/SDD
converged: YES YES NO NO
title: Mulliken charges:
elementType: S O O O O N C C C C C C C C C C C C C C C H H H H H H H H H H H H H H H H H
charge: 0.187668 -0.463047 -0.433944 -0.230959 -0.267735 -0.396114 -0.679917 -0.090792 0.377979 0.309243 -0.223570 -0.702582 -0.362353 -0.065559 -0.372060 -0.413509 -0.249171 -0.242828 0.201684 0.237949 -0.783323 0.297454 0.207884 0.256854 0.313998 0.260637 0.232208 0.289528 0.252702 0.235875 0.227266 0.384069 0.228489 0.338858 0.267016 0.237770 0.235035 0.397296
chargesum: 0.00000
title: Mulliken charges with hydrogens summed into heavy atoms:
elementType: S O O O O N C C C C C C C C C C C C C C C
charge: 0.187668 -0.078978 -0.036648 -0.230959 -0.267735 -0.057256 -0.382463 0.117092 0.377979 0.309243 0.033284 -0.127946 -0.130145 0.223968 -0.119359 -0.177634 -0.021905 -0.014339 0.201684 0.237949 -0.043501
polarizability: 2.26594963e+02 -2.55850859e+01 1.94745006e+02 -1.80878776e+01 -1.85775220e+01 1.71059541e+02
1716.lowfreq: -94.3830 -11.5057 -6.1661 -0.0006 0.0006 0.0009 4.0152 21.7796 27.8962
frequency: -94.3793 21.5947 27.8296 36.6667 56.6802 65.2341 80.0201 90.4829 108.5540 125.9104 150.0321 179.8405 205.4643 208.1951 256.8353 274.9231 286.9726 306.2913 332.7517 364.3862 365.9304 385.4803 413.3181 447.8868 495.7904 503.3217 510.0919 543.0665 553.9136 557.7032 568.9226 591.0467 605.5094 622.5699 626.8730 665.0990 686.5010 706.0850 709.5558 751.3018 765.4175 778.4044 794.7634 813.4063 870.6410 893.5903 899.9718 943.0969 953.8226 966.4215 970.3974 974.5687 986.2927 993.0297 1033.1858 1035.1177 1039.1189 1063.8899 1082.9102 1103.6785 1117.2665 1157.7122 1172.3379 1174.1486 1180.1536 1201.8679 1220.2004 1225.9533 1237.2220 1239.6754 1252.1003 1274.7207 1294.6503 1312.0637 1313.8968 1333.7465 1351.8764 1377.2867 1380.0883 1398.5556 1432.6798 1439.9448 1441.4938 1466.4659 1475.0890 1476.1451 1572.7518 1608.8519 1620.4961 1647.6197 1661.6370 2891.5611 2978.8771 2992.4245 3029.9712 3058.2014 3078.4257 3110.7241 3119.6017 3123.5274 3127.9023 3136.3611 3141.5411 3161.2221 3165.6349 3424.5123 3524.9208 3548.1001
redmass: 1.0382 6.6074 6.6377 6.5434 5.4938 6.0173 4.0100 5.2984 6.5834 5.7032 5.3507 3.2742 6.3884 4.3450 7.5226 6.1740 4.8653 4.2467 3.9685 5.5907 5.6559 4.9571 3.7902 3.4386 3.8965 4.2357 4.0566 1.2373 2.9115 2.6017 2.4698 1.5507 1.4294 5.8770 2.7777 3.7486 4.1760 2.8395 4.5707 1.3318 4.9563 2.7147 2.3549 2.7381 3.3702 1.5945 2.9978 3.6510 1.9623 1.8360 1.6113 1.4390 3.6739 1.3948 3.5708 1.6865 2.4087 2.8722 1.9711 2.0232 3.2889 1.2615 1.1434 1.2833 1.5245 1.4070 1.3434 1.6451 1.3549 1.2251 1.3120 1.4625 1.5441 1.6082 1.4752 1.4525 1.7645 1.2547 4.1411 1.6144 1.1058 2.3399 1.2595 1.0469 1.7015 2.5997 6.5130 6.5223 6.6101 7.6011 8.8416 1.0784 1.0824 1.0379 1.0579 1.0832 1.0982 1.1073 1.0865 1.0875 1.0886 1.0985 1.0935 1.1005 1.0982 1.0669 1.0643 1.0783
irintensity: 0.0155 1.8782 0.8351 5.7523 2.2759 1.7005 3.9248 1.7935 1.0298 0.2333 4.7028 5.9471 0.7042 1.5850 0.4366 3.5006 1.1153 1.7223 2.6550 3.2729 2.3977 1.1709 1.3731 17.7860 9.7238 25.9715 3.8915 119.9283 2.4353 27.0522 51.1325 178.0163 33.3631 4.6930 41.2469 2.5173 15.8712 28.1517 31.7902 24.4633 14.2294 3.1145 34.1334 42.3206 5.0621 4.0628 23.9821 72.3376 4.3889 4.4635 9.0303 4.0927 1.5669 0.3809 32.5328 8.2972 37.2900 8.3834 196.0818 8.8364 32.8530 19.5208 2.0482 12.8263 1.3637 7.2811 7.3350 23.6908 9.5176 58.2343 18.2682 11.0250 31.0427 42.0806 52.5051 20.9475 19.4437 52.7985 2.9271 15.3325 19.0011 9.6958 125.5291 18.4832 132.7065 54.3080 0.4152 0.7531 129.3641 0.5414 209.1420 50.6396 2.6250 8.4390 6.6009 6.6206 13.5805 0.9313 1.4493 11.9084 5.3240 6.3738 21.0420 37.0024 14.3867 205.4949 47.3534 44.2294
temp: 298.150 k
press: 1.00000 atm
elementType: 16 8 8 8 8 7 6 6 6 6 6 6 6 6 6 6 6 6 6 6 6 1 1 1 1 1 1 1 1 1 1 1 1 1 1 1 1 1
symmnumber: 1
zpe: 772324.4 jmol-1
zpe.correction: 0.294163 hartree
zpe.thermalcorrener: 0.314138 hartree
zpe.thermalcorrenthalpy: 0.315082 hartree
zpe.thermalcorrgfe: 0.243688 hartree
zpe.sumelectzpe: -1333.961630 hartree
zpe.sumelectthermal: -1333.941655 hartree
zpe.sumelectthermalent: -1333.940711 hartree
zpe.sumelectthermalfe: -1334.012105 hartree
dipole: 4.4072 2.7754 -2.6547
dipole: 5.8459
quadrupole: -97.4098 -137.6908 -132.2139
quadrupole: -2.3011 -9.1933 -2.3924
quadrupole: 25.0284 -15.2526 -9.7758 -2.3011 -9.1933 -2.3924
hfenergy: -1334.2557933 hartree
pointgroup: C01 [X(C15H17N1O4S1)]
dipole: 1.7195058 -1.1781768 0.9720907 debye
polarizability: 210.446502|20.7171485|207.9280033|35.5017322|-0.4539712|174.0250048 unknown
InChI: InChI=1S/C15H17NO4S/c1-9(17)16-12(15(19)20)8-21-14-11-5-3-2-4-10(11)6-7-13(14)18/h2-7,12-14,16,18-19H,8H2,1H3
charge 0 multiplicity 1
38 atoms
S  -0.416367 0.742473 2.177872
O  -0.534693 3.099778 -0.040433
O  3.645136 1.310945 2.279079
O  2.072821 2.725615 1.328118
O  2.287757 -1.322054 -1.561989
N  3.19585 -0.601625 0.44619
C  -1.629864 0.986605 0.727035
C  -0.99777 1.781921 -0.445922
C  -2.345142 -0.284705 0.258698
C  -3.035947 -0.218013 -0.996454
C  -2.027516 1.972928 -1.544013
C  0.931542 -0.364788 1.452919
C  -2.954556 1.011068 -1.807336
C  2.09981 0.345916 0.681404
C  -2.449103 -1.454794 1.039298
C  -3.810137 -1.32612 -1.424105
C  -3.211422 -2.56182 0.593573
C  -3.895661 -2.496972 -0.640392
C  2.579227 1.587156 1.417329
C  3.215485 -1.389276 -0.700992
C  4.422488 -2.313163 -0.827855
H  -2.37071 1.664377 1.202655
H  -0.160631 1.179433 -0.875348
H  -1.933245 2.887728 -2.138042
H  0.46797 -1.096757 0.771444
H  1.348548 -0.896214 2.325059
H  -3.650437 1.121714 -2.647839
H  1.720527 0.664103 -0.304477
H  -1.940235 -1.492238 2.009236
H  -4.342948 -1.266147 -2.380958
H  -3.273524 -3.464558 1.211338
H  0.26524 3.011279 0.550732
H  -4.491844 -3.348292 -0.986835
H  3.945648 -0.6490 1.139365
H  4.32899 -2.890715 -1.758607
H  5.365127 -1.73659 -0.858331
H  4.478255 -3.015309 0.02413
H  3.90623 2.133014 2.775256
