program: Gaussian 09
title: 000179690
version: EM64L-G09RevD.01
frameworkgroup: C1[X(C20H30N4O3)]
method: RPBEPBE
basis: SDD
operation: Freq
keyword: #p
keyword: freq=noraman
keyword: PBEPBE/SDD
title: #p freq=noraman PBEPBE/SDD
converged: YES YES NO NO
title: Mulliken charges:
elementType: O O O N N N N C C C C C C C C C C C C C C C C C C C C H H H H H H H H H H H H H H H H H H H H H H H H H H H H H H
charge: -0.269623 -0.417644 -0.247433 -0.036102 -0.133014 -0.358742 -0.009675 -0.382581 -0.372966 -0.373841 -0.380986 -0.409743 -0.387530 -0.307293 -0.446537 0.182570 0.225267 -0.570612 -0.359887 0.001234 0.089283 -0.380356 0.205626 -0.365456 -0.684913 0.100828 -0.749384 0.196963 0.201018 0.189395 0.192336 0.193208 0.193383 0.190147 0.233529 0.215147 0.215714 0.210093 0.210928 0.211820 0.210747 0.231486 0.224604 0.266929 0.181946 0.205505 0.230813 0.251847 0.283896 0.218122 0.204178 0.225533 0.363694 0.244199 0.245083 0.238447 0.358799
chargesum: 0.00000
title: Mulliken charges with hydrogens summed into heavy atoms:
elementType: O O O N N N N C C C C C C C C C C C C C C C C C C C C
charge: -0.269623 -0.053950 -0.247433 -0.036102 -0.133014 0.000057 -0.009675 0.015400 0.008765 0.012750 0.042691 0.021119 0.033491 0.115274 0.009553 0.182570 0.225267 -0.121738 0.076431 0.001234 0.089283 -0.128508 0.205626 -0.081560 -0.037080 0.100828 -0.021655
polarizability: 3.50405320e+02 1.19923760e+01 2.59274241e+02 -6.84561650e-02 -9.78186959e+00 1.81773490e+02
1716.lowfreq: -9.9850 -3.5177 -0.0010 -0.0006 0.0010 2.7677 6.4654 9.9448 14.2434
frequency: -3.6857 9.9388 14.2149 20.0218 25.1915 36.1723 41.0818 50.9035 55.0620 63.1012 76.4640 82.0220 94.2323 109.4825 121.4781 138.2978 140.3062 144.0226 156.3307 174.9470 180.5511 195.1241 210.4636 223.8691 256.9102 278.0226 280.1781 294.3045 329.3199 340.6018 346.3947 363.0838 364.8582 374.9276 400.8588 432.4454 474.4473 495.7046 507.2912 536.5496 563.8492 596.7602 609.6141 633.6235 637.4270 647.8622 661.9960 719.4251 720.4284 721.7697 731.6409 738.7514 749.3987 769.7096 778.4527 812.8112 829.3614 841.4821 851.3791 871.1927 897.8511 909.1706 918.1988 919.2418 951.1162 961.6301 964.6650 981.9708 996.4849 1006.1113 1010.3809 1014.6372 1028.5017 1032.0139 1050.7425 1057.2185 1073.9731 1079.6114 1090.5475 1091.9537 1096.0030 1099.5453 1107.0507 1109.8730 1144.1650 1150.4495 1160.8554 1163.2947 1192.0233 1209.7934 1220.3062 1221.2237 1243.5797 1250.6161 1260.8276 1262.8994 1278.9152 1279.2947 1283.2950 1288.7170 1290.8446 1291.1984 1293.2405 1298.8352 1311.7630 1317.4941 1338.3561 1342.5590 1355.9654 1359.9721 1373.9934 1376.2487 1389.7470 1402.0242 1404.0373 1415.0296 1433.0971 1443.8673 1446.3663 1458.8711 1461.7100 1464.2473 1466.7665 1470.4982 1473.1461 1474.3892 1475.6337 1480.0899 1480.3968 1485.7470 1490.1934 1496.1574 1559.5091 1592.9343 1612.8633 2926.6362 2949.9112 2952.3750 2955.9383 2962.6402 2967.6288 2972.5425 2976.2560 2980.0724 2988.6778 2992.1944 2995.7664 2999.4343 3007.1543 3013.3861 3019.5209 3031.5899 3033.0258 3050.1371 3058.5490 3062.3559 3072.1071 3075.9775 3076.7394 3083.2731 3123.1444 3149.1854 3175.3084 3553.1097 3606.1506
redmass: 5.3001 5.9857 7.2576 4.3425 4.7802 4.0981 3.6345 2.6986 2.6240 3.7475 3.6136 1.7410 3.8290 2.1426 3.2254 3.4980 3.9477 2.0018 3.6429 2.8811 2.8074 1.1775 1.5570 2.1923 3.9973 3.8210 3.8274 3.4329 2.5350 3.1600 3.4743 2.8241 5.1758 1.5418 3.7829 3.7416 3.7542 3.3347 3.4712 5.3307 4.2343 4.6695 3.5916 6.4215 3.4709 3.4973 3.9715 7.2169 1.2327 1.1027 1.3452 1.1320 1.7868 6.0507 1.4693 1.4768 1.5507 1.8778 1.5503 1.8587 2.2855 1.5443 5.1440 3.8438 8.7897 2.6798 2.0434 1.3229 1.3518 5.5035 4.5937 3.1181 1.8078 3.4893 2.9708 2.5020 2.4595 2.2014 3.4063 2.1975 3.3316 2.2907 1.8735 2.1190 3.1964 1.6271 2.2405 1.5057 2.2811 1.4662 1.4699 1.3621 1.9768 1.3270 1.6203 1.8100 1.1172 1.3583 1.1761 1.3859 1.4503 1.1405 1.8985 1.1261 1.2803 1.2973 1.4008 1.4645 1.6053 1.5940 1.2640 1.5364 1.2123 1.5811 4.3980 3.6695 1.2366 1.4786 1.0496 1.2227 1.0944 1.1303 1.2380 1.5345 1.2944 1.2004 1.0491 1.3581 1.0871 1.1980 1.1711 1.1007 6.7186 7.8549 6.8863 1.0714 1.0589 1.0570 1.0569 1.0598 1.0613 1.0360 1.0608 1.0638 1.0962 1.0590 1.0356 1.0994 1.0695 1.1051 1.0939 1.1035 1.0953 1.1033 1.0921 1.1054 1.0995 1.1022 1.0993 1.0954 1.1025 1.0886 1.0945 1.0646 1.0845
irintensity: 1.1605 0.7540 3.8610 0.5329 0.7268 3.0638 0.9692 0.4948 0.0475 0.1377 0.8646 0.0284 0.5696 1.4427 0.2911 0.6132 0.5447 0.6375 2.5362 2.3465 1.6474 0.6472 1.0465 1.4478 1.4189 8.1303 3.7775 0.7279 6.0711 14.6639 18.1152 2.6844 3.4608 78.5968 0.8728 0.8208 2.1273 0.8594 0.9810 23.0220 22.7892 2.1691 19.0087 13.9761 4.9534 3.3684 5.4744 9.3318 89.6474 40.1504 0.3890 1.4269 3.7078 0.7995 7.4795 26.8211 13.0330 3.4711 1.5653 7.7834 4.9589 3.5961 5.5787 7.6385 11.8168 2.2694 26.7367 4.5816 1.4017 11.7365 9.8307 100.7689 2.5545 45.9881 2.2080 2.1450 1.1160 1.8509 4.6191 13.4853 5.7345 265.6175 6.8092 1.0793 7.4288 2.8247 24.5210 48.9596 18.8190 1.5584 26.9978 20.1813 146.1506 1.3185 26.5512 64.5035 7.8635 100.8571 3.3077 8.0342 33.6157 12.9392 216.0626 1.2946 1.3100 2.3780 2.4835 1.1324 1.0615 10.1055 87.0672 3.4989 11.2852 11.0583 21.9825 75.1936 52.0555 19.4350 16.7791 10.1516 1.5359 2.4846 15.2046 13.2584 10.7144 8.1437 9.1914 0.3603 5.7148 9.8055 20.4308 26.5635 186.5413 118.0469 221.5069 43.2125 6.3744 3.6554 24.5842 37.9834 21.4116 41.9416 80.0077 21.1544 4.3763 40.2038 3.3681 0.7000 9.1812 21.9307 9.4910 6.3514 4.0328 94.1609 6.2865 108.6705 61.9993 16.0752 43.6854 9.6803 27.2158 0.5103 15.8304 33.9347 103.2498
temp: 298.150 k
press: 1.00000 atm
elementType: 8 8 8 7 7 7 7 6 6 6 6 6 6 6 6 6 6 6 6 6 6 6 6 6 6 6 6 1 1 1 1 1 1 1 1 1 1 1 1 1 1 1 1 1 1 1 1 1 1 1 1 1 1 1 1 1 1
symmnumber: 1
zpe: 1247845.3 jmol-1
zpe.correction: 0.475279 hartree
zpe.thermalcorrener: 0.503993 hartree
zpe.thermalcorrenthalpy: 0.504937 hartree
zpe.thermalcorrgfe: 0.409785 hartree
zpe.sumelectzpe: -1222.685812 hartree
zpe.sumelectthermal: -1222.657098 hartree
zpe.sumelectthermalent: -1222.656154 hartree
zpe.sumelectthermalfe: -1222.751306 hartree
dipole: 6.3479 1.6717 -0.5987
dipole: 6.5916
quadrupole: -184.9639 -169.7782 -156.6167
quadrupole: -41.7587 22.4126 5.7994
quadrupole: -14.5110 0.6747 13.8363 -41.7587 22.4126 5.7994
hfenergy: -1223.1610909 hartree
pointgroup: C01 [X(C20H30N4O3)]
dipole: 2.5236317 0.4399356 -0.4038961 debye
polarizability: 351.2294075|7.972144|242.1127634|-2.406826|-32.8658794|198.1108803 unknown
InChI: InChI=1S/C20H30N4O3/c1-3-10-17-18(13-12-16(15(2)25)20(17)26)27-14-9-7-5-4-6-8-11-19-21-23-24-22-19/h12-13,23,26H,3-11,14H2,1-2H3
charge 0 multiplicity 1
57 atoms
O  -1.929075 -0.192937 -0.312104
O  -6.531514 1.155609 -0.826721
O  -7.721555 -1.946495 1.839716
N  9.380093 -0.348768 1.376437
N  8.133778 0.820959 -0.160708
N  9.446344 1.007984 1.554621
N  8.707327 1.750913 0.644209
C  2.996263 -0.989843 -0.297223
C  4.179292 -1.849467 0.201408
C  1.626508 -1.47304 0.230463
C  5.54661 -1.351355 -0.318311
C  0.45355 -0.608818 -0.287363
C  6.722017 -2.226808 0.168885
C  -0.895044 -1.084326 0.255887
C  8.118413 -1.740613 -0.319069
C  -4.207631 0.456356 -0.575662
C  -3.267839 -0.421701 0.030117
C  -3.739385 1.562662 -1.508023
C  -3.558924 2.93301 -0.790893
C  -5.582251 0.287664 -0.255939
C  8.54567 -0.440689 0.291506
C  -3.688405 -1.446829 0.917825
C  -6.042122 -0.732266 0.6329
C  -5.054083 -1.582447 1.199852
C  -3.107879 4.04589 -1.759412
C  -7.467967 -0.999963 1.028863
C  -8.609053 -0.161134 0.47571
H  2.983087 -0.992805 -1.406859
H  3.155815 0.064679 0.008558
H  4.02519 -2.903636 -0.111779
H  4.188144 -1.852715 1.31171
H  1.638654 -1.460735 1.340436
H  1.471523 -2.530489 -0.069657
H  5.537437 -1.338852 -1.428032
H  5.704401 -0.301202 -0.004371
H  0.424854 -0.636144 -1.393626
H  0.605439 0.447878 0.005255
H  6.722598 -2.274769 1.276341
H  6.579947 -3.264944 -0.192442
H  -1.104161 -2.130507 -0.048501
H  -0.923237 -1.022023 1.36316
H  8.880348 -2.501105 -0.072649
H  8.097057 -1.624827 -1.418392
H  -2.770492 1.27083 -1.947773
H  -4.431525 1.687492 -2.371955
H  -4.501301 3.228813 -0.28719
H  -2.807539 2.805417 0.010835
H  -2.968295 -2.125349 1.381295
H  -5.414974 -2.36058 1.880704
H  -2.149411 3.782983 -2.244771
H  -3.854105 4.212071 -2.560119
H  -2.965411 5.004726 -1.228959
H  -6.082278 1.792982 -1.437655
H  -8.628589 -0.198851 -0.627761
H  -8.477627 0.90391 0.736654
H  -9.556665 -0.540932 0.888743
H  10.003284 1.440635 2.290824
