program: Gaussian 09
title: 000179646
version: EM64L-G09RevD.01
frameworkgroup: C1[X(C11H13NO)]
method: RPBEPBE
basis: SDD
operation: Freq
keyword: #p
keyword: freq=noraman
keyword: PBEPBE/SDD
title: #p freq=noraman PBEPBE/SDD
converged: YES YES NO NO
title: Mulliken charges:
elementType: O N C C C C C C C C C C C H H H H H H H H H H H H H
charge: -0.263754 -0.120222 -0.331759 -0.514717 -0.375764 0.187195 0.450080 -0.616654 -0.364519 -0.394953 -0.235776 -0.247955 -0.240866 0.258980 0.241793 0.236655 0.228154 0.228916 0.224509 0.225439 0.271197 0.255079 0.224246 0.225516 0.221794 0.227385
chargesum: 0.00000
title: Mulliken charges with hydrogens summed into heavy atoms:
elementType: O N C C C C C C C C C C C
charge: -0.263754 -0.120222 -0.072779 -0.036270 0.081306 0.187195 0.450080 0.104491 -0.109440 -0.170707 -0.010260 -0.026160 -0.013481
polarizability: 1.50174221e+02 9.52506441e+00 1.22232323e+02 -8.46996156e+00 1.05797546e+01 8.84070067e+01
1716.lowfreq: -13.2895 -12.1535 -9.3994 0.0003 0.0004 0.0006 17.5366 58.2692 92.7848
frequency: 15.1457 58.0987 92.7701 143.5756 152.7606 211.6946 236.5291 253.8503 291.1298 350.2200 403.2594 439.1569 494.7210 518.3741 614.4211 622.0545 656.1588 680.6058 701.6361 742.2176 750.4258 821.4404 846.5786 887.3475 911.2750 935.9705 969.7819 971.2563 989.6715 993.1825 1026.4024 1046.7529 1055.0950 1089.7616 1101.1247 1117.2721 1168.0979 1172.9479 1182.2695 1193.9755 1214.8761 1228.9086 1264.2941 1273.2335 1293.1441 1320.5561 1340.4311 1383.1688 1394.2847 1423.3256 1437.5814 1477.1902 1478.2236 1482.4011 1486.9687 1501.6579 1591.3694 1611.7762 1642.7527 2956.9182 2965.2196 3017.1326 3028.6443 3040.2463 3040.8264 3091.8708 3097.4892 3120.0375 3128.0416 3139.7974 3148.3141 3163.5175
redmass: 3.8303 3.8337 4.4497 1.4567 1.8144 3.1778 4.0816 2.9076 3.0275 3.7122 2.8074 4.3201 3.3901 3.9446 6.2613 4.7648 4.8528 5.3291 1.7197 2.0344 2.5606 3.2534 1.2524 1.8309 1.5567 2.3893 2.7758 1.3967 3.9428 1.4941 2.3626 1.9400 1.9766 1.6798 1.8537 1.2867 1.7033 1.0523 1.2411 1.1199 1.5252 1.6710 3.5507 1.5861 1.8247 1.3763 1.3234 6.7750 2.2378 1.2291 2.1691 1.0554 1.1201 1.4939 1.3657 1.1437 5.9852 6.0215 8.9122 1.0603 1.0386 1.0822 1.0854 1.0976 1.0823 1.1029 1.0982 1.0843 1.0871 1.0920 1.0964 1.1016
irintensity: 1.2369 1.8217 4.1466 1.3073 1.0076 1.6521 4.7394 1.5031 9.4253 3.3213 0.0449 0.8154 20.4942 2.5991 0.1104 1.7863 5.5087 2.5677 49.0349 31.4929 17.3201 5.9722 0.6550 13.4530 1.5513 0.8909 13.8652 0.6424 0.5292 0.0849 9.7331 5.6263 0.2424 63.6633 10.7695 0.7737 7.9167 0.0700 5.7265 0.2453 0.3930 17.9992 24.7061 51.6206 19.6957 3.5185 2.8169 0.6009 52.9979 47.4920 9.9049 26.7315 12.6525 18.1972 8.4146 10.4866 1.3537 15.3873 262.0036 39.0496 93.5097 12.2580 39.4834 59.3792 16.1043 29.4449 2.7571 3.3386 1.0250 27.5058 36.7593 18.2539
temp: 298.150 k
press: 1.00000 atm
elementType: 8 7 6 6 6 6 6 6 6 6 6 6 6 1 1 1 1 1 1 1 1 1 1 1 1 1
symmnumber: 1
zpe: 566391.2 jmol-1
zpe.correction: 0.215727 hartree
zpe.thermalcorrener: 0.227370 hartree
zpe.thermalcorrenthalpy: 0.228314 hartree
zpe.thermalcorrgfe: 0.176548 hartree
zpe.sumelectzpe: -556.004591 hartree
zpe.sumelectthermal: -555.992949 hartree
zpe.sumelectthermalent: -555.992004 hartree
zpe.sumelectthermalfe: -556.043770 hartree
dipole: -1.1981 -3.8424 -0.2319
dipole: 4.0315
quadrupole: -67.1645 -80.0234 -75.0716
quadrupole: 7.1884 -0.3244 1.5859
quadrupole: 6.9220 -5.9368 -0.9851 7.1884 -0.3244 1.5859
hfenergy: -556.2203182 hartree
pointgroup: C01 [X(C11H13N1O1)]
dipole: -0.4887805 0.2899469 1.4808139 debye
dipolederiv: -0.5793473 -0.0750127 -0.0256213 -0.1025312 -0.4288327 -0.2741285 0.1289754 -0.0821658 -1.1072438 -0.9029804 -0.1394524 0.3377491 -0.3025276 -0.425935 0.0146268 0.2006568 -0.0176898 -0.7275283 -0.2836464 -0.1261407 -0.1417666 -0.1862126 0.0549336 -0.1248346 -0.2160647 -0.071342 -0.0044125 0.0084744 -0.0581188 0.0227667 0.0012444 0.0631191 -0.0266405 0.0744145 0.0030042 0.0280756 0.210905 -0.126928 0.0662271 -0.1534109 0.222307 0.1222284 -0.0125479 0.0546312 0.4988722 1.0199774 0.2978737 -0.3422955 0.5804796 0.2942247 0.20911 -0.3649264 0.0651349 1.3410479 0.4403302 -0.0976381 0.067896 -0.2619919 -0.040044 -0.0591189 0.0419039 -0.0479941 -0.0670762 0.4536651 0.0901111 -0.0037552 0.1549167 0.3358517 -0.0875862 0.1534962 -0.0445054 0.0083498 -0.1816664 -0.0114002 0.0622554 0.0235406 -0.1354479 -0.0084899 0.0990496 -0.0619789 0.064511 -0.1591791 -0.0311134 -0.0693358 0.020561 -0.1386739 0.0074185 -0.1330198 0.0207046 -0.0059648 -0.0024262 -0.0560376 -0.0877916 -0.061175 -0.1094642 0.0097794 -0.1007561 0.0016945 0.0833481 -0.0259426 -0.0611323 0.0266234 -0.0657449 -0.1073749 -0.0603692 0.0488572 -0.0681273 0.098317 -0.0008472 -0.1071505 0.0072291 -0.0924181 -0.1113466 -0.0225888 0.0166331 -0.0195531 -0.0838014 0.0186537 -0.0053519 0.0414255 0.0194914 -0.025716 0.0638107 0.0403556 0.0932298 -0.0102849 -0.034345 0.1197414 0.0070148 0.0835648 -0.0872019 0.0193802 -0.0070413 0.0665227 0.0735234 0.0250105 -0.0722026 -0.1124248 -0.0666043 0.0744537 -0.0071379 -0.103147 -0.0683712 -0.0591525 0.0658534 0.042824 -0.1075909 0.0463367 -0.0693108 0.1065769 -0.0332245 0.0484244 -0.1158945 -0.1580568 0.0714324 0.1262239 0.059868 0.0523827 -0.0539158 0.055501 -0.032612 -0.0063826 -0.1970156 0.0148227 0.0317846 0.0886813 0.0115094 -0.0123651 0.068242 -0.0134901 0.1086035 0.0098931 0.0175913 -0.0404256 -0.0862555 -0.0903304 0.1103874 0.0015803 0.1635414 0.0111647 0.1475877 0.0104441 0.0407639 -0.0106232 0.0965953 -0.0195459 -0.0710863 -0.0933221 -0.0178805 0.1050579 0.0486108 -0.0672126 0.0381373 0.1053125 0.0434059 -0.0493259 0.0525749 -0.0189772 0.0295609 0.037623 0.1196618 0.0300954 0.1149163 -0.0231462 0.130658 -0.0248291 -0.0378716 0.0102658 0.0474135 0.101171 0.0583494 0.1314857 -0.0154349 0.1175012 -0.0179859 -0.0491052 0.0633715 0.0486577 -0.0462837 0.0596298 0.1165959 0.0680353 -0.0713075 0.0742138 -0.0932473 -0.0831537 0.1205335 -0.0142889 0.1245986 0.0959906 0.0205429 -0.0153773 0.0202906 0.0890098 unknown
polarizability: 148.8402804|-14.6126945|87.1373523|-6.8606778|-1.7435258|124.8359184 unknown
InChI: InChI=1S/C11H13NO/c1-12-8-7-10(11(12)13)9-5-3-2-4-6-9/h2-6,10H,7-8H2,1H3
charge 0 multiplicity 1
26 atoms
O  -1.398826 -0.183626 -2.068241
N  -2.409173 -0.108236 0.062993
C  -0.454012 1.226141 -0.199869
C  -1.222735 1.684443 1.066207
C  -2.210842 0.524113 1.380155
C  -1.452584 0.242568 -0.880382
C  0.889993 0.520088 0.015722
C  -3.446674 -1.105207 -0.189577
C  1.71953 0.287268 -1.113488
C  1.327598 0.059377 1.282861
C  2.957421 -0.376067 -0.97771
C  2.569099 -0.604251 1.421666
C  3.390224 -0.82287 0.293228
H  -0.295157 2.064951 -0.900217
H  -1.801204 2.594554 0.830016
H  -0.565457 1.918368 1.918913
H  -1.79132 -0.20477 2.104671
H  -3.17294 0.889944 1.785328
H  -4.45523 -0.682582 -0.019982
H  -3.320141 -1.990897 0.463418
H  -3.358938 -1.421538 -1.242375
H  1.376449 0.612803 -2.102098
H  0.709496 0.217846 2.173691
H  3.583188 -0.545547 -1.861229
H  2.893063 -0.949292 2.410394
H  4.352771 -1.335284 0.401304
