program: Gaussian 09
title: 000179638
version: EM64L-G09RevD.01
frameworkgroup: C1[X(C11H11N3O3)]
method: RPBEPBE
basis: SDD
operation: Freq
keyword: #p
keyword: freq=noraman
keyword: PBEPBE/SDD
title: #p freq=noraman PBEPBE/SDD
converged: YES YES NO NO
title: Mulliken charges:
elementType: O O O N N N C C C C C C C C C C C H H H H H H H H H H H
charge: -0.288311 -0.411139 -0.238981 -0.464742 -0.381735 -0.094468 0.309207 0.040967 0.131302 -0.558027 0.258286 -0.470318 -0.360471 -0.339301 -0.211773 -0.232746 0.193883 0.284557 0.238930 0.372476 0.347425 0.297436 0.261449 0.237222 0.248120 0.224218 0.225620 0.380913
chargesum: 0.00000
title: Mulliken charges with hydrogens summed into heavy atoms:
elementType: O O O N N N C C C C C C C C C C C
charge: -0.288311 -0.030225 -0.238981 -0.092266 -0.034310 -0.094468 0.309207 0.040967 0.131302 -0.034540 0.258286 0.088567 -0.123249 -0.091181 0.012445 -0.007126 0.193883
polarizability: 2.65370509e+02 -1.37156396e+00 1.36627532e+02 1.66587916e+00 9.89515597e-01 7.55024302e+01
1716.lowfreq: -8.9786 -0.7333 0.0005 0.0007 0.0009 6.3365 21.1387 30.9312 47.4646
frequency: 21.0865 30.9165 47.4511 78.3033 86.7237 106.4725 147.7616 182.2703 212.2995 256.2829 279.1118 316.9034 351.4729 434.7847 445.8225 476.5220 507.5078 531.1176 566.0888 579.2039 595.3709 614.7771 648.1211 663.5879 673.9855 702.5866 745.4359 752.3335 765.1489 780.6230 797.4202 824.4959 857.4008 872.4340 890.1996 935.6825 951.4893 975.6106 988.8694 1011.3634 1017.9457 1052.7878 1095.5110 1110.2848 1151.4948 1160.1782 1180.4631 1197.9908 1219.8360 1242.8816 1262.8093 1265.5903 1310.0650 1323.2413 1374.4867 1397.8479 1412.0693 1440.5434 1442.1332 1452.1580 1471.3614 1484.3182 1561.6128 1588.4565 1603.0385 1640.3657 1663.4368 2989.5373 3003.6395 3045.6609 3076.5119 3132.2203 3145.7925 3160.7527 3172.8343 3494.8887 3513.6433 3541.1221
redmass: 6.4438 8.7196 5.9333 5.1076 2.5368 5.2928 5.5398 4.9333 6.7776 5.3249 5.2935 8.3080 4.9023 3.1334 3.9475 5.4129 2.4067 3.2459 4.2140 3.7037 4.0113 6.6349 1.4197 1.5389 4.8409 3.0295 4.0548 1.2711 3.2635 1.2321 1.8881 4.1082 1.4870 5.3308 4.3789 1.3808 5.6313 1.3030 4.8231 2.3453 2.1665 2.8883 2.3825 1.6458 1.3171 1.1317 1.5826 1.7856 2.0231 1.3480 1.4627 2.3341 1.9847 1.7048 2.3033 3.1681 3.8820 3.3602 1.0904 1.1084 3.4126 2.7937 4.5609 7.0258 6.0278 7.2746 8.1652 1.0613 1.0637 1.0982 1.0972 1.0854 1.0903 1.0961 1.0994 1.0829 1.0640 1.0775
irintensity: 0.1251 1.0369 0.1585 0.1200 3.4120 6.6826 15.4540 4.0545 2.0765 4.1448 1.6175 11.7239 2.2642 4.7372 42.5771 4.2537 42.9924 8.8761 41.8067 0.9721 10.0279 0.0603 121.1703 73.0815 14.1261 20.1232 18.9803 56.0996 18.8559 121.0555 41.9832 3.5722 0.0679 3.8025 6.0411 4.8491 9.6206 0.0057 3.7913 7.2967 63.4325 214.4460 70.8406 5.9167 29.0595 0.3034 55.9635 12.4921 21.1203 30.8147 76.8195 18.3175 21.6872 19.7465 161.0939 44.9580 27.6841 39.6121 15.3992 59.5698 8.4747 61.4848 502.5223 122.3830 36.8184 84.0280 204.4327 8.8362 31.4168 10.7847 7.3884 1.2982 10.7259 23.0710 22.5675 159.7584 29.2440 47.6476
temp: 298.150 k
press: 1.00000 atm
elementType: 8 8 8 7 7 7 6 6 6 6 6 6 6 6 6 6 6 1 1 1 1 1 1 1 1 1 1 1
symmnumber: 1
zpe: 556888.9 jmol-1
zpe.correction: 0.212108 hartree
zpe.thermalcorrener: 0.226877 hartree
zpe.thermalcorrenthalpy: 0.227821 hartree
zpe.thermalcorrgfe: 0.167717 hartree
zpe.sumelectzpe: -814.524177 hartree
zpe.sumelectthermal: -814.509408 hartree
zpe.sumelectthermalent: -814.508464 hartree
zpe.sumelectthermalfe: -814.568568 hartree
dipole: 1.7983 0.6355 -0.9652
dipole: 2.1376
quadrupole: -85.2761 -97.6581 -103.9582
quadrupole: -3.9560 -6.2689 3.4375
quadrupole: 10.3547 -2.0273 -8.3274 -3.9560 -6.2689 3.4375
hfenergy: -814.7362849 hartree
pointgroup: C01 [X(C11H11N3O3)]
dipole: 0.7110807 -0.2745494 0.3553527 debye
polarizability: 265.3061716|0.9571256|136.3015413|-4.0751822|4.4858303|75.8927583 unknown
InChI: InChI=1S/C11H11N3O3/c15-9(5-6-10(16)17)14-11-12-7-3-1-2-4-8(7)13-11/h1-4,12,14,16H,5-6H2
charge 0 multiplicity 1
28 atoms
O  1.347478 -1.269423 -0.329713
O  6.392481 -0.86568 0.4961
O  5.718432 0.763179 -1.014874
N  -1.307279 -0.714572 -0.164312
N  0.542298 0.875902 0.081157
N  -1.783492 1.493705 0.254331
C  -2.708603 -0.630328 -0.11105
C  -2.989263 0.758456 0.150704
C  -0.826896 0.571189 0.05915
C  2.979467 0.563392 -0.120845
C  1.574668 -0.032689 -0.122501
C  4.028698 -0.48005 0.300093
C  -3.726816 -1.592305 -0.260171
C  -4.327358 1.197594 0.26578
C  -5.056759 -1.131905 -0.141116
C  -5.351533 0.238899 0.117175
C  5.420884 -0.098161 -0.157026
H  3.217084 0.908067 -1.147193
H  3.030052 1.458861 0.525802
H  -0.682131 -1.510981 -0.325371
H  0.748665 1.863338 0.251369
H  3.766699 -1.455878 -0.154705
H  4.037845 -0.648255 1.390819
H  -3.507698 -2.646241 -0.45908
H  -4.548869 2.250481 0.463762
H  -5.8816 -1.844578 -0.250171
H  -6.398156 0.551139 0.201198
H  7.293802 -0.621958 0.149589
