program: Gaussian 09
title: 000179647
version: EM64L-G09RevD.01
frameworkgroup: C1[X(C11H17NO7)]
method: RPBEPBE
basis: SDD
operation: Freq
keyword: #p
keyword: freq=noraman
keyword: PBEPBE/SDD
title: #p freq=noraman PBEPBE/SDD
converged: YES YES NO NO
title: Mulliken charges:
elementType: O O O O O O O N C C C C C C C C C C C H H H H H H H H H H H H H H H H H
charge: -0.372914 -0.270443 -0.459840 -0.455910 -0.453120 -0.449119 -0.482394 0.004522 -0.161633 -0.082824 -0.163023 -0.006136 0.015058 -0.395041 -0.160326 0.495491 -0.480079 -0.183205 -0.683316 0.233023 0.222224 0.251675 0.246789 0.233231 0.195150 0.260439 0.372936 0.369964 0.371184 0.286090 0.367122 0.234272 0.224310 0.243909 0.231541 0.400392
chargesum: 0.00000
title: Mulliken charges with hydrogens summed into heavy atoms:
elementType: O O O O O O O N C C C C C C C C C C C
charge: -0.372914 -0.270443 -0.086904 -0.085947 -0.081936 -0.081997 -0.082002 0.004522 0.071390 0.139400 0.088651 0.240653 0.248289 0.060549 0.125764 0.495491 -0.021497 -0.183205 -0.207867
polarizability: 1.92722126e+02 9.34087613e+00 1.51702765e+02 4.26945434e+00 -8.39876818e+00 1.04831574e+02
1716.lowfreq: -9.0284 0.0005 0.0008 0.0008 6.9864 9.8750 31.8019 43.8791 64.5456
frequency: 31.6193 43.8638 64.5356 66.0574 83.1901 98.1740 117.2242 134.3913 148.1104 156.6847 187.2703 198.3596 213.3338 228.5269 245.5380 255.8335 273.0270 300.4013 334.0200 355.5765 386.8423 393.0483 407.3850 425.5236 432.2933 439.6628 458.4073 479.9142 497.6400 538.4643 543.6745 554.2746 570.7883 590.4137 607.9444 643.3175 697.5911 828.3453 856.8211 862.3615 878.6584 930.8774 948.9325 959.3252 965.9295 976.9428 982.6108 988.8759 997.2037 1016.9842 1024.6830 1028.0778 1041.7675 1045.6127 1057.7033 1068.6449 1102.2767 1117.6232 1171.2901 1198.9937 1204.4078 1209.5867 1218.0442 1227.5439 1250.9336 1267.7021 1277.6875 1294.0821 1307.7730 1310.4737 1325.0592 1331.2304 1349.1796 1355.9265 1370.7841 1374.0113 1377.0217 1391.8349 1393.5775 1437.4479 1454.2240 1455.4105 1503.5155 1666.1101 2199.5433 2944.2047 2955.9207 2960.5221 2967.1188 2968.1480 2982.6301 3000.7611 3008.3521 3070.5347 3095.1159 3097.5614 3100.2909 3201.9169 3473.6206 3546.2706 3564.2217 3571.0335
redmass: 7.4759 5.8209 5.3173 5.0528 5.8340 6.6724 7.7435 3.6872 4.1472 4.2445 4.1535 5.5040 4.4779 4.3887 5.0980 6.0279 5.4567 3.7175 5.7082 4.1565 3.3673 1.2765 4.4554 1.9358 1.6957 1.5737 2.4573 4.1927 4.0003 4.9851 1.3766 4.1027 3.4900 2.9058 3.9815 3.2666 1.4641 1.7308 4.2371 3.2354 1.6092 7.0171 3.9486 3.0891 1.3758 5.2722 3.2341 2.7280 3.7037 2.3167 2.6325 5.0270 4.0126 3.1537 2.6898 2.6269 2.5480 3.1016 1.2727 1.2135 1.4221 1.2283 1.0824 1.1682 1.2522 1.2247 1.2566 1.5890 1.2568 1.2982 1.3965 1.3281 1.2174 1.2089 1.6668 1.2599 1.3588 1.3428 1.7976 1.1735 1.0760 1.0751 1.1088 5.4456 12.5645 1.0843 1.0815 1.0668 1.0738 1.0795 1.0819 1.0844 1.0851 1.0884 1.0950 1.0760 1.0654 1.1146 1.0680 1.0657 1.0657 1.0662
irintensity: 1.0278 0.7598 1.8754 2.3526 1.5233 1.5840 2.4932 3.2117 3.8573 6.4661 6.1154 4.6647 2.9232 11.9298 6.7945 6.9834 20.5569 8.0913 1.0437 17.8858 0.7791 117.5264 14.9132 28.8728 75.4937 183.6857 65.2738 6.0413 11.9797 5.1927 138.1459 7.0481 37.7503 60.1249 18.0257 17.0286 7.3019 68.4491 69.6765 23.3693 45.9013 254.3307 20.9444 32.9521 61.5360 90.9439 121.1215 30.9092 100.2212 26.3418 51.3026 128.2561 83.9291 106.5533 15.5718 32.1703 6.1899 13.9285 19.6167 16.2172 5.6926 12.4053 31.6970 23.7362 6.0870 1.2426 40.1140 4.9921 55.3114 4.9952 13.8491 9.5717 4.6562 10.2264 5.3636 15.6670 1.4368 6.9871 23.9761 20.6947 1.8241 10.9660 45.2798 3.0758 0.7690 20.4622 5.0460 40.6736 4.5431 59.5559 6.1661 27.3811 72.8421 406.9966 3.5791 393.2752 40.9183 8.4599 139.6649 23.9791 24.8333 19.0752
temp: 298.150 k
press: 1.00000 atm
elementType: 8 8 8 8 8 8 8 7 6 6 6 6 6 6 6 6 6 6 6 1 1 1 1 1 1 1 1 1 1 1 1 1 1 1 1 1
symmnumber: 1
zpe: 737586.3 jmol-1
zpe.correction: 0.280932 hartree
zpe.thermalcorrener: 0.300990 hartree
zpe.thermalcorrenthalpy: 0.301934 hartree
zpe.thermalcorrgfe: 0.232587 hartree
zpe.sumelectzpe: -1009.096391 hartree
zpe.sumelectthermal: -1009.076333 hartree
zpe.sumelectthermalent: -1009.075389 hartree
zpe.sumelectthermalfe: -1009.144736 hartree
dipole: 0.2253 -1.7208 -3.1031
dipole: 3.5555
quadrupole: -115.3922 -128.9181 -114.4038
quadrupole: -14.4241 5.7457 -3.6016
quadrupole: 4.1791 -9.3467 5.1676 -14.4241 5.7457 -3.6016
hfenergy: -1009.3773232 hartree
pointgroup: C01 [X(C11H17N1O7)]
dipole: -0.0813979 -1.0745622 -0.8918663 debye
polarizability: 194.2388649|2.3600362|138.1843448|-4.8384243|-21.9729956|116.8332546 unknown
InChI: InChI=1S/C11H17NO7/c1-5(3-13)6(2-12)18-11-10(17)9(16)8(15)7(4-14)19-11/h6-11,13-17H,1,3-4H2
charge 0 multiplicity 1
36 atoms
O  0.686595 0.572064 -0.354877
O  -1.19824 -0.774332 -0.00832
O  3.308897 -2.638396 -0.020008
O  4.334219 0.032868 0.052776
O  0.613375 -2.935965 0.979141
O  1.697351 3.362767 -0.459914
O  -1.154022 2.368936 -0.832341
N  -3.63389 -1.272284 2.346136
C  2.456455 -1.525755 0.403517
C  2.970413 -0.289652 -0.357166
C  0.973689 -1.810787 0.115455
C  2.098124 0.940636 -0.040117
C  0.149031 -0.55564 0.437525
C  2.425899 2.174893 -0.892266
C  -2.231993 0.158029 0.585416
C  -3.049052 0.784292 -0.5379
C  -2.232581 1.644677 -1.507207
C  -3.020351 -0.621053 1.557976
C  -4.388936 0.613431 -0.650917
H  2.570742 -1.353222 1.497077
H  2.926276 -0.51166 -1.446132
H  0.824687 -2.055704 -0.956371
H  2.176969 1.20225 1.035263
H  0.19576 -0.300562 1.520847
H  2.245791 1.938524 -1.962696
H  3.494738 2.403859 -0.753201
H  2.994215 -3.459583 0.437682
H  4.867165 -0.801951 -0.013133
H  -0.319985 -3.208038 0.788306
H  -1.698708 0.974017 1.116683
H  0.758113 3.349535 -0.78997
H  -2.885839 2.398927 -1.975233
H  -1.816199 0.994831 -2.305794
H  -4.958394 -0.031525 0.027337
H  -4.956931 1.124254 -1.436845
H  -0.408982 1.704218 -0.650228
