program: Gaussian 09
title: 000179635
version: EM64L-G09RevD.01
frameworkgroup: C1[X(C14H7NO5)]
method: RPBEPBE
basis: SDD
operation: Freq
keyword: #p
keyword: freq=noraman
keyword: PBEPBE/SDD
title: #p freq=noraman PBEPBE/SDD
converged: NO YES NO NO
title: Mulliken charges:
elementType: O O O O O N C C C C C C C C C C C C C C H H H H H H H
charge: -0.143698 -0.439726 -0.217727 -0.190684 -0.195562 0.010826 0.247212 0.220481 0.212594 0.192280 -0.306725 0.208491 0.294033 -0.419704 -0.430599 -0.365900 -0.365834 -0.218217 -0.210550 0.084087 0.288670 0.291363 0.277974 0.280391 0.248930 0.251214 0.396382
chargesum: 0.00000
title: Mulliken charges with hydrogens summed into heavy atoms:
elementType: O O O O O N C C C C C C C C C C C C C C
charge: -0.143698 -0.043344 -0.217727 -0.190684 -0.195562 0.010826 0.247212 0.220481 0.212594 0.192280 -0.306725 0.208491 0.294033 -0.131034 -0.139236 -0.087927 -0.085443 0.030713 0.040664 0.084087
polarizability: 2.53354009e+02 1.13946671e+00 2.23436515e+02 -1.63283657e+01 2.22439262e-01 7.64676153e+01
1716.lowfreq: -7.1537 -2.5701 -0.0006 -0.0004 0.0006 2.7828 49.4540 73.8328 81.6474
frequency: 49.4435 73.8286 81.6429 91.7481 121.7909 165.0066 180.0153 182.2210 188.9049 238.2796 277.4653 295.7965 325.3840 344.0041 376.4169 391.8493 435.6946 446.2343 485.6673 529.4726 557.9828 569.2102 584.1767 598.9418 612.0241 640.5136 665.7723 695.1252 709.7232 727.0608 763.3221 772.7170 776.3877 801.1221 823.2473 863.5611 869.1782 951.2724 955.4895 963.6452 992.2598 997.6561 1005.8619 1025.4248 1065.7099 1090.6541 1136.6964 1166.9218 1169.3594 1190.0891 1197.3228 1229.0137 1232.0777 1266.7919 1315.6784 1369.7637 1375.0223 1393.6658 1410.1232 1448.1559 1461.3297 1470.7832 1575.0655 1583.0627 1605.7459 1611.3449 1636.6491 1646.6224 3148.1367 3152.9228 3158.7295 3167.1018 3175.1434 3183.5602 3521.6698
redmass: 9.6492 7.1314 13.8021 11.4224 7.4774 8.0193 4.9908 6.5090 6.8761 7.0118 10.8432 5.4368 8.7820 6.8849 5.9038 8.8523 5.2837 5.6343 4.2174 5.9250 3.1782 5.9439 5.9832 1.6319 4.6715 5.0271 6.0501 6.8774 7.8527 3.8302 6.0824 2.8443 2.0522 8.1224 1.8959 2.6842 7.4992 1.3989 7.3597 1.4573 6.1841 1.4137 1.4089 3.4145 2.0867 1.5700 3.8980 1.4451 1.3939 3.1714 1.6796 4.3398 2.6675 2.4143 3.1478 8.8096 6.9620 2.7152 3.0575 2.7163 3.9528 4.3572 7.6424 7.8421 7.4885 7.7234 11.2182 9.5448 1.0873 1.0884 1.0925 1.0929 1.0997 1.0984 1.0641
irintensity: 0.1810 6.8391 1.1882 0.2537 2.2772 2.9925 1.3454 1.8190 2.4876 1.3982 4.7483 4.1332 0.3963 1.5386 2.4559 1.5187 1.6463 6.3024 3.5818 6.3078 0.3210 2.0042 2.4835 70.1620 29.6462 37.3514 20.4963 7.3959 22.9524 69.5731 3.2256 9.4437 60.9450 11.0838 0.6980 30.6170 4.3955 2.0170 48.3708 0.6056 9.0687 1.3830 2.6926 111.1249 13.4552 6.5282 7.3715 24.8213 1.6066 4.0517 19.5895 168.4884 20.0361 56.6756 75.3969 127.0931 20.1030 1.6619 54.4179 17.2967 11.6344 3.7516 44.1359 5.0961 31.8764 50.3277 275.7602 160.4889 1.0083 0.7557 0.5056 5.6745 11.7967 4.2760 49.4236
temp: 298.150 k
press: 1.00000 atm
elementType: 8 8 8 8 8 7 6 6 6 6 6 6 6 6 6 6 6 6 6 6 1 1 1 1 1 1 1
symmnumber: 1
zpe: 474663.0 jmol-1
zpe.correction: 0.180790 hartree
zpe.thermalcorrener: 0.196119 hartree
zpe.thermalcorrenthalpy: 0.197063 hartree
zpe.thermalcorrgfe: 0.138209 hartree
zpe.sumelectzpe: -967.127964 hartree
zpe.sumelectthermal: -967.112635 hartree
zpe.sumelectthermalent: -967.111691 hartree
zpe.sumelectthermalfe: -967.170545 hartree
dipole: -1.0933 2.2291 1.4905
dipole: 2.8958
quadrupole: -90.5803 -131.3812 -115.1632
quadrupole: 2.8677 -0.1837 -7.0295
quadrupole: 21.7946 -19.0063 -2.7883 2.8677 -0.1837 -7.0295
hfenergy: -967.3087537 hartree
pointgroup: C01 [X(C14H7N1O5)]
dipole: 0.9346584 -0.2596553 -0.5974947 debye
polarizability: 223.9179972|-3.9506431|252.3110713|-4.3036779|18.6208274|77.0290699 unknown
InChI: InChI=1S/C14H7NO5/c16-13-7-3-1-5-9(14(17)18)11(7)12-8(13)4-2-6-10(12)15(19)20/h1-6,17H
charge 0 multiplicity 1
27 atoms
O  3.784012 0.598851 -0.073927
O  -2.361762 0.149508 -1.27736
O  -3.396939 1.855557 -0.088009
O  -2.15552 -0.853742 1.369786
O  -2.612186 -2.689987 0.097912
N  -1.812893 -1.777198 0.536377
C  0.178837 0.818662 0.032088
C  0.406705 -0.665978 -0.006213
C  1.464276 1.44573 0.114663
C  1.813227 -0.895027 -0.147939
C  2.537678 0.414862 -0.036666
C  -0.963658 1.655863 -0.03422
C  -0.399408 -1.820728 0.104322
C  1.635523 2.829406 0.258336
C  2.381639 -2.166931 -0.295127
C  -0.791818 3.059918 0.157242
C  0.145091 -3.11971 -0.079431
C  0.47978 3.644083 0.322588
C  1.524752 -3.295625 -0.297208
C  -2.352539 1.243489 -0.402095
H  2.644762 3.249191 0.318319
H  3.466958 -2.266192 -0.397339
H  -1.692374 3.682554 0.147976
H  -0.53307 -3.975874 -0.022514
H  0.567854 4.725296 0.465765
H  1.929087 -4.303251 -0.430953
H  -3.302415 -0.087028 -1.501673
