program: Gaussian 09
title: 000179618
version: EM64L-G09RevD.01
frameworkgroup: C1[X(C12H10O3)]
method: RPBEPBE
basis: SDD
operation: Freq
keyword: #pfreq=noraman
keyword: PBEPBE/SDD
title: #p freq=noraman PBEPBE/SDD
converged: YES YES NO NO
title: Mulliken charges:
elementType: O O O C C C C C C C C C C C C H H H H H H H H H H
charge: -0.360010 -0.469594 -0.437262 0.289543 -0.049258 0.358525 -0.363613 0.206565 -0.185667 -0.350094 -0.355065 -0.384635 -0.205710 -0.193851 -0.250273 0.265274 0.229665 0.253542 0.272395 0.257115 0.230263 0.231511 0.231826 0.394383 0.384425
chargesum: 0.00000
title: Mulliken charges with hydrogens summed into heavy atoms:
elementType: O O O C C C C C C C C C C C C
charge: -0.360010 -0.075211 -0.052837 0.289543 -0.049258 0.358525 -0.098339 0.206565 0.043998 -0.096552 -0.082670 -0.127521 0.024553 0.037660 -0.018447
polarizability: 2.05074418e+02 3.56041708e+00 1.26867624e+02 8.03176097e+00 7.17880646e+00 8.47576062e+01
1716.lowfreq: -6.5445 0.0002 0.0004 0.0004 4.3912 10.2496 26.5127 42.9276 78.3267
frequency: 26.1821 42.9254 78.3215 153.2812 190.3547 242.8550 243.5387 275.1134 284.5318 320.0412 412.0586 454.3827 461.5285 476.0734 485.2897 519.0544 533.3920 541.2051 563.6923 607.4538 610.6245 683.0892 690.5780 707.7469 758.2294 765.0288 779.0456 820.3033 834.4192 866.4393 906.9969 944.6214 966.7155 969.3947 986.4399 988.2498 1020.4041 1051.7148 1079.0984 1145.1975 1154.8900 1166.7137 1172.3749 1181.9128 1193.2182 1227.0500 1248.5672 1309.8942 1342.5996 1384.5478 1416.3048 1442.3259 1469.4736 1472.2728 1490.4248 1596.0693 1605.3470 1618.0010 1625.5877 3133.0432 3142.2251 3147.5024 3158.2145 3166.3796 3168.8841 3175.3940 3182.4252 3529.3445 3546.0681
redmass: 6.3598 4.1672 5.2612 7.8937 4.9714 4.2780 5.7296 5.3031 5.7052 5.8083 2.9248 1.5257 2.4466 1.1639 3.4003 4.2293 5.8849 4.1932 6.2977 6.0036 6.7324 5.4005 2.4614 3.2691 1.4903 1.7658 4.5517 6.3364 1.2535 1.3785 1.4082 1.2891 4.2232 1.3743 4.8747 1.3820 2.0520 1.9557 1.5018 1.5252 1.7000 1.2551 1.1511 1.3468 2.1155 2.4838 2.4202 1.3336 1.6155 8.8689 5.9947 2.3114 2.7988 2.3235 4.1857 6.3578 6.5174 6.8353 7.6279 1.0851 1.0892 1.0870 1.0929 1.0959 1.0933 1.1009 1.0982 1.0651 1.0649
irintensity: 0.7271 0.1318 0.1221 0.5664 3.4771 0.8007 2.2217 8.5048 7.2518 14.0361 0.3983 187.4574 102.9283 28.1874 6.9515 4.0484 11.0089 0.8523 1.4176 12.3872 4.9152 10.1535 29.4360 2.2722 120.9612 34.1702 16.2955 18.0871 0.8558 0.3492 5.6009 1.2176 96.3943 2.0686 0.3569 0.6101 21.6942 43.7602 12.7983 233.9331 46.6971 122.5462 62.0778 13.9115 197.4042 85.7049 114.8543 1.9259 112.9301 3.2492 2.2351 2.5074 140.9132 73.7050 76.8264 36.9882 113.3535 10.5868 44.8651 1.3263 10.7992 8.4488 25.2381 12.2420 3.4156 9.1974 6.0986 75.1943 77.2867
temp: 298.150 k
press: 1.00000 atm
elementType: 8 8 8 6 6 6 6 6 6 6 6 6 6 6 6 1 1 1 1 1 1 1 1 1 1
symmnumber: 1
zpe: 496167.1 jmol-1
zpe.correction: 0.188980 hartree
zpe.thermalcorrener: 0.201583 hartree
zpe.thermalcorrenthalpy: 0.202527 hartree
zpe.thermalcorrgfe: 0.149064 hartree
zpe.sumelectzpe: -687.871588 hartree
zpe.sumelectthermal: -687.858985 hartree
zpe.sumelectthermalent: -687.858041 hartree
zpe.sumelectthermalfe: -687.911503 hartree
dipole: -2.9376 0.1407 0.1079
dipole: 2.9429
quadrupole: -86.7568 -78.4642 -88.0888
quadrupole: 0.7572 -0.5504 1.8040
quadrupole: -2.3202 5.9724 -3.6522 0.7572 -0.5504 1.8040
hfenergy: -688.0605676 hartree
pointgroup: C01 [X(C12H10O3)]
dipole: -1.154806 0.03585 0.0757918 debye
dipolederiv: -2.2494795 -0.1759098 0.0737946 0.0656998 -0.2839635 -0.0837292 -0.1015947 -0.0813065 -0.323641 -0.2540487 -0.1611606 0.0256345 -0.0689131 -1.1951066 -0.2622768 0.032735 -0.2525152 -0.456222 -0.9939099 0.5838248 0.0654386 0.7194044 -0.6840828 0.0777843 0.0438973 0.0724992 -0.3741833 1.3244234 0.2256968 0.1385006 0.251805 0.2107309 -0.0148739 0.5772869 0.0842165 0.0661516 -0.4667103 0.3210875 0.0400061 0.0508462 0.891432 0.3003589 -0.0465192 0.3433238 0.0869393 1.7238805 0.0491853 -0.2334166 -0.3318629 0.0351919 0.0181501 -0.5108067 -0.0283972 0.2338411 -0.2817101 -0.0391689 0.015816 -0.0907272 -0.179022 0.0044434 -0.0571515 -0.0150697 -0.1762462 0.9609987 -0.7276943 -0.0284775 -0.5947648 0.5011051 -0.0282974 0.0612722 -0.0645831 0.0631813 0.1233143 0.027889 0.0824305 -0.0632178 0.0575758 0.0431409 0.0595175 0.0700505 -0.1239262 -0.0959752 0.0089531 0.042369 0.1802101 -0.1491345 0.0728285 0.0675351 0.016906 -0.1599902 -0.2848877 -0.0150575 0.0322675 0.1190066 -0.1490461 0.0011479 0.3395913 0.0198963 -0.1369275 -0.4288297 -0.0160924 0.0623352 -0.0494175 -0.1646651 0.0524431 -0.0690814 0.0520698 0.0305058 0.131028 0.0020525 0.0308379 -0.02359 -0.117499 0.0697625 -0.0500237 0.0617077 0.1402889 0.1510309 0.005969 0.0085353 0.0030866 -0.1266407 0.0563231 0.039867 0.049436 0.0921918 -0.0485163 -0.027178 -0.0828517 -0.009655 -0.1786197 0.0154567 -0.0542397 0.0198843 -0.1456522 0.0066387 0.079394 -0.0283639 0.110488 0.0679016 -0.0145059 -0.0476386 -0.020568 0.1448121 0.0719416 -0.0116483 -0.017196 -0.0340405 -0.0877963 -0.0632933 -0.0268268 -0.0697264 0.1403518 -0.0356767 -0.0406115 -0.0596195 -0.0357244 0.093639 -0.0305901 -0.0619792 -0.0362728 0.1521055 0.0213471 -0.0074014 -0.0727467 0.0106759 0.1397703 -0.0328719 -0.1239329 -0.0240746 0.0663848 0.1105428 0.0151031 0.0414882 0.0106623 0.157301 -0.0480512 0.0323294 -0.0461102 -0.0395251 0.0652444 0.0005372 0.0200694 0.0044998 0.1403609 -0.0597283 0.0513731 -0.0517245 -0.0945446 -0.0603873 -0.0237442 -0.0960672 -0.0203261 0.148477 -0.0344971 -0.1031935 -0.0319872 0.0177992 -0.1047225 0.0162279 0.0686503 0.024783 0.1628433 -0.0286559 0.0722274 -0.0239522 0.066454 0.2602232 0.0317678 -0.0721301 -0.0543765 0.4164491 0.049408 -0.0673053 0.0174345 0.3728768 0.3542403 -0.1220209 -0.0573043 -0.174552 0.2927984 -0.0598764 -0.057339 -0.0611371 0.3569747 unknown
polarizability: 205.2288027|-1.2467443|110.7936541|7.8394391|21.635506|100.6771913 unknown
InChI: InChI=1S/C12H10O3/c13-10-7-4-8-11(12(10)14)15-9-5-2-1-3-6-9/h1-8,13-14H
charge 0 multiplicity 1
25 atoms
O  -0.314846 -0.423486 -0.894671
O  1.910861 -2.029056 -0.676672
O  4.325324 -1.044731 0.195595
C  0.85129 0.180846 -0.340745
C  1.968261 -0.677159 -0.295383
C  -1.593879 -0.207206 -0.306132
C  0.961407 1.535133 0.038517
C  3.221144 -0.189258 0.149516
C  2.216678 2.008841 0.486665
C  3.345679 1.158002 0.545025
C  -1.76898 0.110712 1.059663
C  -2.698273 -0.400523 -1.163769
C  -3.082857 0.239608 1.564147
C  -4.003938 -0.271985 -0.642127
C  -4.202682 0.051017 0.721296
H  0.093488 2.197745 -0.02105
H  2.318815 3.056858 0.785246
H  4.319549 1.519968 0.885541
H  -0.903475 0.248412 1.714626
H  -2.521562 -0.644385 -2.215704
H  -3.227306 0.483039 2.622539
H  -4.864705 -0.420373 -1.303192
H  -5.216713 0.152932 1.121585
H  0.99584 -2.234482 -1.001006
H  4.053281 -1.944067 -0.127112
