program: Gaussian 09
title: 000179619
version: EM64L-G09RevD.01
frameworkgroup: C1[X(C12H14N2O2)]
method: RPBEPBE
basis: SDD
operation: Freq
keyword: #p
keyword: freq=noraman
keyword: PBEPBE/SDD
title: #p freq=noraman PBEPBE/SDD
converged: NO NO NO NO
title: Mulliken charges:
elementType: O O N N C C C C C C C C C C C C H H H H H H H H H H H H H H
charge: -0.289418 -0.261221 -0.237749 -0.062641 -0.095567 -0.242040 -0.513037 -0.399199 -0.460556 -0.422975 0.482144 -0.416786 0.135921 -0.038537 -0.142285 -0.336544 0.225924 0.241549 0.246245 0.222775 0.262952 0.256076 0.230866 0.228385 0.231660 0.277732 0.236637 0.161677 0.232622 0.245392
chargesum: 0.00000
title: Mulliken charges with hydrogens summed into heavy atoms:
elementType: O O N N C C C C C C C C C C C C
charge: -0.289418 -0.261221 -0.237749 -0.062641 0.130356 -0.000491 -0.044017 0.119828 -0.001304 0.086416 0.482144 -0.180149 0.135921 0.123139 0.090337 -0.091152
polarizability: 1.47195091e+02 1.34951950e+01 1.42666176e+02 -1.24688887e+01 1.33184389e+01 1.29882229e+02
1716.lowfreq: -0.0003 0.0006 0.0007 7.4116 11.1628 27.6888 37.5776 60.5436 89.5246
frequency: 37.4874 60.5188 89.4895 160.2874 209.6064 228.4145 255.9947 279.5909 299.4362 326.6451 363.1794 372.2643 414.0691 440.8021 475.8070 495.1447 502.6516 555.1772 593.8342 635.9585 643.8727 705.3016 727.8258 762.2269 792.4425 794.7727 809.0577 858.8215 877.4707 896.0831 911.8160 930.3012 954.3627 963.2400 979.6414 987.4273 1030.9309 1052.7924 1056.8405 1093.7523 1101.8092 1121.6321 1126.6683 1159.6929 1173.6802 1202.3251 1215.3807 1225.0132 1229.1490 1258.5174 1270.3113 1301.2309 1323.3909 1334.2837 1335.0362 1347.8563 1355.4295 1370.1284 1383.1756 1398.5587 1404.2304 1432.3355 1464.8452 1468.2166 1480.9602 1486.6403 1552.1109 1562.6212 1628.2277 1649.3617 2935.5830 2943.5118 2959.8006 2992.1932 2997.9492 3017.4200 3030.8695 3040.4962 3050.0628 3054.6536 3077.0176 3139.4101 3168.8944 3186.4416
redmass: 9.0549 5.5553 4.3985 3.8098 4.4461 3.5082 4.1862 4.3024 3.3235 2.8075 2.9127 2.4451 2.2397 4.8974 3.2754 3.5715 5.3802 4.6834 5.7001 4.9174 5.0927 4.0074 2.2189 4.2959 2.0679 3.4769 3.2730 1.4735 2.9238 2.6728 1.7546 1.9166 1.7740 1.8582 1.3098 3.0249 2.6291 2.1216 2.4393 1.8446 1.4286 1.5891 1.5539 1.8846 1.4781 1.8375 1.6263 1.3609 1.7204 1.2906 2.1404 1.6506 1.5333 1.4676 1.6980 1.4565 1.4725 1.4194 1.3040 2.1703 2.3541 1.8404 1.0939 1.0885 1.1150 1.2969 6.4039 7.7039 6.8998 7.6302 1.0841 1.0686 1.0685 1.0635 1.0638 1.0813 1.0858 1.0953 1.1007 1.1035 1.0945 1.0886 1.0937 1.0968
irintensity: 1.2309 3.7516 3.2309 3.4398 2.3836 3.8988 14.1732 4.6684 3.6238 4.9753 8.3918 1.3656 1.1974 3.8797 2.9651 1.2874 4.3037 2.8048 1.7038 1.2699 2.6605 0.9420 13.6680 3.9913 45.8967 23.1521 4.8970 1.4091 3.4124 3.7265 4.9648 4.3863 4.0247 0.4676 0.4786 10.5253 0.4119 28.0997 17.3798 15.5927 5.7481 5.8694 29.1046 27.0144 38.8523 22.5923 1.1989 6.4840 13.1307 15.8460 11.2397 13.8435 2.2904 3.4182 13.6958 1.2022 9.8357 5.4392 16.1855 2.3020 53.9468 11.8321 33.9315 11.6687 10.4396 12.7433 89.3397 185.4505 329.7717 232.2567 57.7257 69.0452 55.0915 22.9123 6.1263 66.1075 33.6907 13.9261 11.4572 35.4982 6.7659 16.2431 6.6350 5.7360
temp: 298.150 k
press: 1.00000 atm
elementType: 8 8 7 7 6 6 6 6 6 6 6 6 6 6 6 6 1 1 1 1 1 1 1 1 1 1 1 1 1 1
symmnumber: 1
zpe: 643486.0 jmol-1
zpe.correction: 0.245091 hartree
zpe.thermalcorrener: 0.257774 hartree
zpe.thermalcorrenthalpy: 0.258718 hartree
zpe.thermalcorrgfe: 0.205818 hartree
zpe.sumelectzpe: -724.470125 hartree
zpe.sumelectthermal: -724.457442 hartree
zpe.sumelectthermalent: -724.456498 hartree
zpe.sumelectthermalfe: -724.509399 hartree
dipole: -3.4568 -2.8656 4.6482
dipole: 6.4628
quadrupole: -96.1122 -100.6753 -94.4598
quadrupole: 17.7592 4.5556 4.9169
quadrupole: 0.9703 -3.5929 2.6226 17.7592 4.5556 4.9169
hfenergy: -724.7152161 hartree
pointgroup: C01 [X(C12H14N2O2)]
dipole: 1.2661017 1.4294818 1.6788731 debye
polarizability: 145.5205085|15.8045558|139.6529317|11.1887301|-13.8052817|134.5700563 unknown
InChI: InChI=1S/C12H14N2O2/c15-8-13-5-9-4-10(7-13)11-2-1-3-12(16)14(11)6-9/h1-3,8-10H,4-7H2
charge 0 multiplicity 1
30 atoms
O  -2.514149 0.939713 -1.897331
O  2.05468 -2.605761 -0.97501
N  -0.982219 0.560151 -0.155244
N  2.108288 -0.346513 -0.333054
C  1.156362 1.959261 -0.128677
C  0.735601 0.271795 1.652381
C  1.079115 1.758503 1.402907
C  -0.223066 1.696038 -0.76132
C  2.282087 1.06517 -0.714564
C  1.889997 -0.620143 1.096797
C  -0.590799 -0.10017 1.004027
C  -1.393116 -1.112062 1.526173
C  -2.210934 0.251675 -0.867684
C  2.160604 -1.381052 -1.255263
C  -2.606406 -1.474575 0.864136
C  -3.001493 -0.818337 -0.293771
H  1.425012 3.008623 -0.357331
H  0.65459 0.069012 2.735701
H  0.311572 2.4214 1.843524
H  2.047459 2.008969 1.876769
H  -0.86537 2.593264 -0.678506
H  -0.145313 1.490563 -1.844423
H  2.299185 1.136575 -1.817803
H  3.259086 1.438714 -0.337617
H  2.815148 -0.401907 1.671002
H  1.661718 -1.694728 1.195289
H  -1.072854 -1.623999 2.437155
H  2.308296 -1.008428 -2.294445
H  -3.227645 -2.276572 1.277823
H  -3.925036 -1.069478 -0.821441
