program: Gaussian 09
title: 000179677
version: EM64L-G09RevD.01
frameworkgroup: C1[X(C13H12Cl2O5S)]
method: RPBEPBE
basis: SDD
operation: Freq
keyword: #p
keyword: freq=noraman
keyword: PBEPBE/SDD
title: #p freq=noraman PBEPBE/SDD
converged: YES YES NO NO
title: Mulliken charges:
elementType: Cl Cl S O O O O O C C C C C C C C C C C C C H H H H H H H H H H H H
charge: -0.315057 -0.219295 0.745714 -0.730281 -0.732361 -0.292894 -0.380562 -0.295974 -0.062379 -0.069183 0.419683 -0.482517 -0.376035 -0.358037 -0.226713 -0.618532 0.401484 -0.241068 -0.729430 -0.307421 0.165182 0.157754 0.268797 0.191704 0.303293 0.166573 0.215281 0.221228 0.179302 0.184576 0.222234 0.245158 0.349774
chargesum: -2.00000
title: Mulliken charges with hydrogens summed into heavy atoms:
elementType: Cl Cl S O O O O O C C C C C C C C C C C C C
charge: -0.315057 -0.219295 0.745714 -0.730281 -0.732361 -0.292894 -0.030788 -0.295974 -0.062379 -0.069183 0.419683 -0.055966 -0.184331 0.111830 -0.226713 -0.403251 0.401484 -0.241068 -0.144324 0.159971 0.165182
polarizability: 7.78804043e+02 1.14892598e+02 2.84416005e+02 -1.98525987e+01 2.63031424e-01 1.37940812e+02
1716.lowfreq: -6.1853 -2.8265 -0.0019 -0.0016 -0.0011 4.3090 15.8314 20.5771 23.4324
frequency: 15.4965 20.5722 23.4107 31.3391 38.6565 43.0756 58.2167 68.0112 89.7917 108.1921 120.0946 133.2303 149.2036 156.1205 173.4738 179.2482 206.0219 210.7797 222.1609 227.9003 237.9270 249.3685 280.7931 321.1894 336.2193 349.7985 385.9118 405.0238 413.2097 474.1655 485.2960 524.7908 533.4094 539.3652 554.5723 582.5645 622.4747 638.1557 660.2266 696.7207 711.6143 731.5611 752.1327 766.1512 818.5517 844.8008 856.7343 869.6247 889.5074 908.2374 917.5602 972.1068 989.4944 1024.6009 1056.8999 1086.9207 1092.7146 1117.8064 1142.0283 1196.5082 1215.3216 1227.4916 1251.3831 1267.9347 1292.5040 1317.2601 1329.9181 1337.0706 1349.4020 1355.7210 1358.3090 1429.7480 1444.3974 1452.5231 1465.3635 1477.2507 1494.0798 1506.8278 1570.5824 1610.0480 1629.5501 2886.4534 2904.4283 2933.9937 2940.1307 2947.5638 2965.8187 3002.3033 3002.7160 3025.9368 3047.3206 3077.4669 3487.6849
redmass: 8.3316 12.0265 6.8289 10.9096 4.9797 7.0944 10.6437 7.1366 2.8653 3.8005 3.4351 10.0943 3.9905 8.8259 9.5512 8.5000 8.2226 6.9497 4.5650 1.4810 9.7470 2.4219 5.3390 7.1183 7.8441 5.4835 8.0852 5.8598 4.7168 3.0869 3.9943 5.6661 4.9075 4.7868 7.0126 3.8132 6.2897 2.2054 5.0592 3.7390 15.9988 18.0792 1.9631 1.7750 4.4617 1.6857 2.3575 1.6995 2.7693 1.6653 3.5632 2.0160 5.9968 3.6114 2.5844 1.8955 2.1928 1.5888 1.6772 1.1138 1.6494 2.9375 3.6955 1.3161 1.2409 2.7361 1.6336 1.4963 2.4911 1.4691 1.2276 7.2937 1.0730 1.0771 1.0448 1.0449 1.0887 7.1096 9.6797 7.1323 8.4867 1.0583 1.0647 1.0407 1.0568 1.0992 1.0842 1.1005 1.0920 1.0996 1.0997 1.0900 1.0631
irintensity: 1.6381 0.9309 2.1334 1.0306 2.2734 0.5483 5.4004 2.3142 3.0378 4.5923 1.9377 2.9811 3.7909 2.7459 15.2214 10.4802 23.6140 33.2153 27.8537 0.7074 14.0250 6.5789 18.0425 0.5360 69.9018 2.7237 17.2908 7.6180 14.9429 9.7869 18.8075 47.0417 19.1089 10.2290 15.8282 14.4737 62.0245 109.9046 6.1936 3.3921 169.7596 140.4154 4.8867 5.7112 530.2309 20.6444 26.5021 38.7197 154.7817 41.0547 6.0726 12.6432 9.5405 4.3351 1.2658 1214.9407 19.2078 13.4120 8.9329 200.6705 14.3419 29.9488 82.3550 0.2059 52.4692 55.7210 41.0007 68.9236 19.3813 32.8714 21.0942 7.6286 15.0534 29.3588 10.8595 2.0304 12.6686 77.5483 241.1964 1715.5887 14.0084 163.4096 44.9256 184.8052 22.4336 23.2427 88.6197 12.7162 30.6319 93.6535 56.3744 45.0362 114.7025
temp: 298.150 k
press: 1.00000 atm
elementType: 17 17 16 8 8 8 8 8 6 6 6 6 6 6 6 6 6 6 6 6 6 1 1 1 1 1 1 1 1 1 1 1 1
symmnumber: 1
zpe: 573706.5 jmol-1
zpe.correction: 0.218513 hartree
zpe.thermalcorrener: 0.242410 hartree
zpe.thermalcorrenthalpy: 0.243354 hartree
zpe.thermalcorrgfe: 0.159784 hartree
zpe.sumelectzpe: -2195.165072 hartree
zpe.sumelectthermal: -2195.141175 hartree
zpe.sumelectthermalent: -2195.140230 hartree
zpe.sumelectthermalfe: -2195.223801 hartree
dipole: -12.3917 -10.4237 -1.1825
dipole: 16.2359
quadrupole: -300.0501 -195.9268 -167.8940
quadrupole: -11.2437 1.5003 4.8938
quadrupole: -78.7598 25.3635 53.3963 -11.2437 1.5003 4.8938
hfenergy: -2195.3835848 hartree
pointgroup: C01 [X(C13H12Cl2O5S1)]
dipole: -4.9060981 -3.846004 -1.3932567 debye
polarizability: 781.8712214|107.7324724|274.8274289|19.1003504|31.4690872|144.46221 unknown
InChI: InChI=1S/C13H12Cl2O5S/c1-2-3-9(21(18)19)4-8-5-10(14)13(15)11(6-8)20-7-12(16)17/h4,6,16H,2-3,7H2,1H3
charge -2 multiplicity 1
33 atoms
Cl -0.890546 3.906196 1.402363
Cl -3.711365 2.280132 0.336044
S  3.811458 1.348267 0.63793
O  5.041746 1.684947 -0.489994
O  4.496931 0.652075 2.034406
O  -3.094268 -0.616067 -0.637323
O  -5.50231 -1.700073 -1.242519
O  -5.638624 -2.723696 0.830078
C  3.121523 -0.289036 -0.226611
C  0.459542 1.455189 0.384687
C  0.554571 0.129915 -0.147848
C  4.279315 -1.170591 -0.635091
C  1.808833 -0.595899 -0.441287
C  4.792811 -2.069618 0.526288
C  -0.736615 2.0589 0.573783
C  -0.672551 -0.550005 -0.436136
C  -1.911744 0.106885 -0.251857
C  -1.94087 1.437533 0.247296
C  6.041075 -2.883375 0.118304
C  -3.942264 -0.97421 0.498461
C  -5.067528 -1.888039 0.075971
H  3.997784 -1.801289 -1.508203
H  5.095909 -0.476709 -0.944178
H  1.634817 -1.575271 -0.933868
H  5.007174 -1.385691 1.372706
H  3.979774 -2.754261 0.848388
H  -0.687871 -1.581288 -0.820334
H  6.865126 -2.198812 -0.162093
H  5.833339 -3.535478 -0.756626
H  6.399244 -3.527263 0.947301
H  -3.363435 -1.492259 1.289605
H  -4.38533 -0.052214 0.942239
H  -6.256054 -2.335396 -1.391683
