program: Gaussian 09
title: 000179615
version: EM64L-G09RevD.01
frameworkgroup: C1[X(C10H12O)]
method: RPBEPBE
basis: SDD
operation: Freq
keyword: #pfreq=noraman
keyword: PBEPBE/SDD
title: #p freq=noraman PBEPBE/SDD
converged: YES YES NO NO
title: Mulliken charges:
elementType: O C C C C C C C C C C H H H H H H H H H H H H
charge: -0.275698 0.532664 -0.528443 0.336148 -0.431986 -0.379207 -0.224319 -0.319372 -0.152934 -0.743467 -0.537226 0.243715 0.227022 0.241299 0.220670 0.218961 0.215978 0.225017 0.225015 0.223219 0.219779 0.219792 0.243373
chargesum: 0.00000
title: Mulliken charges with hydrogens summed into heavy atoms:
elementType: O C C C C C C C C C C
charge: -0.275698 0.532664 -0.284728 0.336148 -0.204964 -0.137908 -0.003649 -0.100411 0.063044 -0.070217 0.145719
polarizability: 1.81533454e+02 -1.18687952e+01 1.22563369e+02 -2.26656556e-02 -7.24608487e-02 5.57914940e+01
1716.lowfreq: -9.0270 -5.9304 -4.8226 -0.0009 -0.0006 -0.0005 47.9167 77.8302 115.2965
frequency: 47.4367 77.8265 115.2923 128.3306 182.1711 200.3116 241.8182 261.6744 288.6673 316.8969 394.2795 452.4185 454.8046 545.7239 595.1398 607.9688 691.0905 730.4627 772.4930 821.6180 878.1515 889.6273 892.3378 954.1682 964.0401 983.8167 984.3486 1022.4158 1042.6150 1090.2537 1111.4683 1114.4579 1146.0327 1168.2796 1188.6758 1241.4292 1288.8208 1306.7845 1325.1128 1391.1157 1394.6912 1432.2726 1450.8985 1459.2414 1466.2396 1468.5133 1474.7532 1477.8015 1580.9703 1618.6211 1672.7785 2956.4309 2960.7902 3032.3151 3043.2067 3072.0331 3080.7700 3100.9458 3121.7891 3123.2989 3144.3315 3159.1518 3168.1900
redmass: 1.9792 2.5321 3.6114 2.6206 1.2453 1.5784 3.1753 1.9203 2.8676 3.4989 4.7000 2.8101 4.2079 4.7594 3.7409 5.1510 1.8532 5.2036 1.4547 1.5381 1.4527 2.7539 1.7525 2.2893 1.2955 1.3101 3.5462 3.1547 1.5448 1.8075 1.2602 2.1307 1.5711 1.4700 1.2775 2.0805 1.5130 1.3523 1.4512 3.2805 1.5653 1.3211 2.1154 1.0475 1.0501 1.2094 1.1075 1.9468 5.7682 6.4712 5.6727 1.0331 1.0367 1.0966 1.1039 1.0958 1.0916 1.0901 1.0986 1.0869 1.0933 1.0909 1.0964
irintensity: 0.9793 7.8454 0.9823 0.0011 1.2379 0.6303 3.0693 1.2024 0.1355 0.7627 0.3023 3.2556 1.8899 7.1555 0.6751 3.4932 20.4903 12.2054 65.0648 0.0108 2.9012 1.7481 14.7907 42.7322 4.5733 53.3489 10.0012 48.8361 1.1188 4.3717 0.2738 2.6651 23.0452 65.3963 7.6970 74.6216 28.6283 8.5319 4.9463 19.7530 0.8190 28.5785 46.9703 14.5060 12.8000 10.1898 14.7008 36.3815 64.2783 98.5624 6.6780 75.5104 45.7349 26.1762 52.2558 11.1766 11.9523 52.5181 24.2724 9.9884 27.6887 4.2952 14.6195
temp: 298.150 k
press: 1.00000 atm
elementType: 8 6 6 6 6 6 6 6 6 6 6 1 1 1 1 1 1 1 1 1 1 1 1
symmnumber: 1
zpe: 498665.8 jmol-1
zpe.correction: 0.189932 hartree
zpe.thermalcorrener: 0.201088 hartree
zpe.thermalcorrenthalpy: 0.202032 hartree
zpe.thermalcorrgfe: 0.152626 hartree
zpe.sumelectzpe: -462.645734 hartree
zpe.sumelectthermal: -462.634578 hartree
zpe.sumelectthermalent: -462.633634 hartree
zpe.sumelectthermalfe: -462.683039 hartree
dipole: -0.9785 0.3560 0.0063
dipole: 1.0413
quadrupole: -47.5022 -61.9329 -70.9817
quadrupole: -0.7698 -0.0338 -0.0334
quadrupole: 12.6367 -1.7940 -10.8427 -0.7698 -0.0338 -0.0334
hfenergy: -462.8356655 hartree
pointgroup: C01 [X(C10H12O1)]
dipole: -0.3857405 -0.1379513 -0.0004035 debye
dipolederiv: -1.2478904 0.5137785 -0.0224626 0.8441572 -0.7950266 0.0210036 -0.0326185 0.0184649 -0.3044024 0.4217721 0.0786648 -0.0013212 0.1226781 0.1936073 -0.0016763 -0.0060418 -0.0035731 0.0717166 -0.499328 0.234317 -0.0083163 0.1120503 -0.074328 -0.0014384 -0.0041012 -0.0009519 -0.1901608 0.8014479 -0.5339479 0.0209144 -1.0046903 0.7808396 -0.0273571 0.0348101 -0.0240283 0.1115111 -0.3048214 -0.1692379 0.0052229 -0.1462759 -0.1196831 -0.0042957 0.0033431 -0.0046618 -0.2296504 -0.1927541 -0.0788356 0.0032552 0.3374506 -0.2962597 0.0042418 -0.0097179 0.0010185 -0.232724 0.2553438 0.0901352 0.0004563 -0.0177823 0.1613658 -0.0089898 0.0051223 -0.0072264 -0.1280094 0.0475408 -0.0556823 0.0049037 -0.3025805 0.0282235 -0.0129878 0.0188065 -0.0089444 -0.1887252 0.2610838 0.0556331 0.0032175 0.0342385 0.1082515 -0.0166811 0.0059748 -0.0148974 -0.2337647 -0.165294 -0.046384 -0.000757 -0.189648 0.0097182 0.0021571 0.0030526 0.0022647 0.0925326 0.8751956 -0.2278423 0.0110394 0.0395233 0.2071407 0.0039368 0.0034353 0.0017749 0.3303284 0.0914766 -0.0660036 0.0009756 -0.0465755 -0.041154 0.005062 0.0003872 0.0052846 0.1576215 -0.0119574 0.1239046 -0.0053715 0.0945 -0.0274377 0.0064806 -0.0045405 0.0066506 0.1662135 -0.1121568 -0.0209824 -0.0016726 -0.0206314 0.102136 0.0019278 -0.001905 0.0019726 0.1733823 0.0449963 -0.0770127 0.0014667 -0.0800677 -0.1148642 0.0074937 0.0013707 0.0074329 0.1530937 -0.0376561 0.0558982 -0.0048463 0.1308812 -0.0663382 0.0110373 -0.0081384 0.0097821 0.1536117 -0.0310295 0.1031883 -0.0070073 0.1158338 -0.0529879 0.0115535 -0.007859 0.0109467 0.1571041 -0.0515976 -0.0727084 0.0541016 -0.0236201 0.0622433 0.1071748 0.1258297 0.1172608 -0.0585927 -0.0490241 -0.0750211 -0.0470558 -0.0321445 0.0414871 -0.1168775 -0.1225941 -0.1277642 -0.041115 0.0092292 0.0334287 -0.0024998 0.1630132 -0.1061443 0.0112044 -0.0080317 0.0100309 0.1065587 -0.0600272 0.0291402 0.034954 -0.135238 0.0543897 0.11501 0.0893214 0.0709693 -0.0988693 -0.0581058 0.0282944 -0.0360823 -0.1382172 0.0430175 -0.1255125 -0.0808347 -0.0788574 -0.0895164 0.0135564 0.0772753 -0.0031145 0.1431452 -0.0981965 0.0075329 -0.0050708 0.0070515 0.1218561 unknown
polarizability: 181.6607634|11.5545002|122.361506|0.420002|-2.1518721|55.8660475 unknown
InChI: InChI=1S/C10H12O/c1-3-5-9-6-4-7-10(8-9)11-2/h3-8H,1-2H3
charge 0 multiplicity 1
23 atoms
O  -2.294922 1.518427 -0.076402
C  0.793999 -0.514499 0.00921
C  -0.112736 0.575164 -0.030469
C  -1.507762 0.353122 -0.035564
C  0.261106 -1.837409 0.045224
C  -2.033683 -0.964219 -0.000712
C  -1.13036 -2.051218 0.039787
C  2.263127 -0.342703 0.015767
C  2.959315 0.828781 -0.0317
C  4.465276 0.932996 -0.020488
C  -3.74887 1.352514 -0.083417
H  0.237951 1.611408 -0.056693
H  0.947568 -2.691724 0.07666
H  -3.111703 -1.149154 -0.004008
H  -1.524426 -3.073433 0.067289
H  2.83984 -1.27917 0.06352
H  2.41395 1.783029 -0.083012
H  4.837604 1.448121 -0.928231
H  4.818784 1.526961 0.845746
H  4.942054 -0.061938 0.029187
H  -4.10237 0.841291 0.83355
H  -4.087577 0.788661 -0.974794
H  -4.154569 2.37449 -0.116448
