program: Gaussian 09
title: 000179603
version: EM64L-G09RevD.01
frameworkgroup: C1[X(C11H14O3)]
method: RPBEPBE
basis: SDD
operation: Freq
keyword: #pfreq=noraman
keyword: PBEPBE/SDD
title: #p freq=noraman PBEPBE/SDD
converged: NO YES NO NO
title: Mulliken charges:
elementType: O O O C C C C C C C C C C C H H H H H H H H H H H H H H
charge: -0.204581 -0.395042 -0.219355 0.157322 -0.466191 0.389733 -0.186763 -0.475203 -0.743322 0.259647 -0.346027 -0.573646 0.173834 -0.816285 0.219697 0.243325 0.258958 0.234322 0.230243 0.253851 0.231099 0.222124 0.222512 0.270205 0.232181 0.238387 0.231618 0.357356
chargesum: 0.00000
title: Mulliken charges with hydrogens summed into heavy atoms:
elementType: O O O C C C C C C C C C C C
charge: -0.204581 -0.037686 -0.219355 0.157322 -0.003169 0.389733 0.072195 -0.010638 -0.036247 0.259647 -0.123515 -0.303441 0.173834 -0.114099
polarizability: 1.70335503e+02 1.88701689e+01 1.29379246e+02 2.33303331e+00 -3.12452984e+00 8.82745328e+01
1716.lowfreq: -12.5527 -4.5641 -0.0007 -0.0006 -0.0006 14.4881 61.7817 117.8536 143.3209
frequency: 61.7663 117.8498 143.3121 145.8161 197.1824 209.9286 216.4904 238.2139 265.5667 282.0180 322.5633 341.9669 369.3546 389.0053 400.4350 438.1224 467.3679 488.6021 529.6525 549.0428 632.6502 665.2861 687.5912 700.9228 706.3000 792.2663 822.2391 859.1482 876.0935 891.6826 904.8814 927.8960 941.8330 967.7553 1006.7240 1013.6717 1035.2935 1050.4977 1088.7251 1096.4686 1160.3166 1183.4421 1189.8559 1197.2696 1214.5622 1238.7126 1259.5904 1302.1542 1323.0156 1334.9796 1351.7315 1371.7658 1381.9005 1399.7509 1406.6706 1452.1228 1467.7728 1469.0299 1476.5372 1479.4027 1483.3184 1586.6829 1631.0366 1647.9019 2953.4795 2977.1045 2986.2600 2994.3982 3017.1333 3054.2385 3058.4393 3080.4098 3091.2799 3101.3878 3105.5093 3109.4632 3173.8169 3521.7258
redmass: 4.5612 6.2782 3.9545 2.7804 1.7188 1.4678 1.5694 2.1733 2.8416 1.9470 2.4618 2.3049 2.5040 4.5252 2.4176 3.3298 3.9649 4.2782 5.0429 4.8156 3.1815 3.7130 4.5295 3.7332 3.5596 4.0245 1.5393 1.8232 3.0800 1.5770 3.6447 2.4689 1.9888 2.1354 2.0795 2.5447 1.8218 1.5203 1.8803 1.9157 3.0722 1.9657 2.2287 1.6716 2.1990 1.6346 1.3423 1.5193 1.4907 1.5064 1.4928 1.2011 1.8192 1.2724 1.5003 1.0932 1.0718 1.0454 1.0656 1.0662 1.0710 8.7236 7.1043 8.5105 1.0668 1.0376 1.0370 1.0623 1.0903 1.0976 1.1014 1.0985 1.0985 1.0995 1.0888 1.0912 1.0912 1.0651
irintensity: 0.2279 2.2923 0.3948 0.5596 2.5882 0.4416 1.4428 0.1464 3.0541 1.2658 3.2864 23.6083 24.7052 0.2596 25.9221 20.5565 4.1224 4.3602 5.5353 6.0029 4.6248 4.8780 10.9255 2.5675 0.7517 40.0280 8.8262 16.5136 51.6258 28.4564 133.9731 8.6876 12.2083 1.7605 23.5776 124.6006 1.0684 4.7348 15.4634 10.7065 88.5721 34.3267 17.0263 7.3778 5.3722 22.7536 8.0458 35.4390 3.2354 0.5480 7.3835 17.2285 9.4767 23.4393 20.0708 15.9782 13.2481 15.5199 2.0661 4.7048 31.2539 13.1730 255.5602 215.5103 21.9957 23.0215 20.5528 21.7666 35.7466 15.5127 23.2576 20.8382 12.7010 11.3503 19.5162 26.2146 3.2943 6.4856
temp: 298.150 k
press: 1.00000 atm
elementType: 8 8 8 6 6 6 6 6 6 6 6 6 6 6 1 1 1 1 1 1 1 1 1 1 1 1 1 1
symmnumber: 1
zpe: 598589.5 jmol-1
zpe.correction: 0.227991 hartree
zpe.thermalcorrener: 0.241123 hartree
zpe.thermalcorrenthalpy: 0.242067 hartree
zpe.thermalcorrgfe: 0.189704 hartree
zpe.sumelectzpe: -652.169903 hartree
zpe.sumelectthermal: -652.156770 hartree
zpe.sumelectthermalent: -652.155826 hartree
zpe.sumelectthermalfe: -652.208189 hartree
dipole: -7.4012 -0.2720 0.1428
dipole: 7.4076
quadrupole: -98.3628 -80.7176 -83.4217
quadrupole: -3.3716 -1.0063 -6.1835
quadrupole: -10.8621 6.7831 4.0790 -3.3716 -1.0063 -6.1835
hfenergy: -652.3978933 hartree
pointgroup: C01 [X(C11H14O3)]
dipole: -2.9135623 0.0493156 -0.0471464 debye
polarizability: 171.0417825|-18.1020173|128.5525085|-2.273742|-3.723228|88.3949899 unknown
InChI: InChI=1S/C11H14O3/c1-7-4-3-5-11(2)8(7)6-9(12)14-10(11)13/h4,6,10,13H,3,5H2,1-2H3
charge 0 multiplicity 1
28 atoms
O  2.285711 0.690336 -0.232362
O  1.130279 1.528189 1.712642
O  3.233726 -1.402815 -0.341314
C  -0.213796 0.914815 -0.323813
C  -1.41092 1.689326 0.292688
C  -0.307242 -0.582185 0.013802
C  1.113855 1.465615 0.271635
C  -2.764896 1.067992 -0.108667
C  -0.188444 1.088673 -1.871427
C  -1.635609 -1.206433 0.149769
C  -2.768399 -0.43327 0.064364
C  0.862304 -1.306829 0.096403
C  2.197076 -0.727652 -0.158813
C  -1.726873 -2.70861 0.35522
H  -1.363926 2.748881 -0.024503
H  -1.31819 1.680823 1.394113
H  1.313836 2.496417 -0.057204
H  -3.012702 1.315174 -1.163621
H  -3.578883 1.513579 0.495346
H  0.699198 0.605567 -2.312684
H  -1.086123 0.641538 -2.331979
H  -0.163528 2.16247 -2.135907
H  -3.747845 -0.928141 0.122544
H  0.866256 -2.384872 0.278384
H  -1.219225 -3.022119 1.287105
H  -1.250567 -3.26133 -0.476434
H  -2.778843 -3.032663 0.420678
H  0.94797 0.627421 2.090132
