program: Gaussian 09
title: 000179606
version: EM64L-G09RevD.01
frameworkgroup: C1[X(C11H15NO2)]
method: RPBEPBE
basis: SDD
operation: Freq
keyword: #p
keyword: freq=noraman
keyword: PBEPBE/SDD
title: #p freq=noraman PBEPBE/SDD
converged: YES YES NO NO
title: Mulliken charges:
elementType: O O N C C C C C C C C C C C H H H H H H H H H H H H H H H
charge: -0.308673 -0.304272 -0.253139 -0.529996 0.365301 0.089661 -0.544180 -0.458005 0.076557 -0.395381 0.188724 -0.371140 -0.531142 -0.528934 0.216331 0.217622 0.244451 0.240615 0.219956 0.226371 0.251485 0.233729 0.248457 0.259383 0.217463 0.228241 0.221735 0.227525 0.251257
chargesum: 0.00000
title: Mulliken charges with hydrogens summed into heavy atoms:
elementType: O O N C C C C C C C C C C C
charge: -0.308673 -0.304272 -0.001654 -0.096043 0.365301 0.089661 -0.059115 -0.011678 0.076557 -0.161653 0.188724 -0.122683 0.173944 0.171583
polarizability: 1.69031096e+02 -6.37406432e+00 1.37384067e+02 1.95742946e+00 -3.05583112e+00 8.37675968e+01
1716.lowfreq: -12.1250 -7.8735 -0.0007 -0.0006 -0.0006 7.9077 61.2173 74.6308 104.6486
frequency: 61.1607 74.5791 104.6308 110.9799 119.9768 157.0124 165.6757 180.4513 234.6948 254.4060 292.9126 306.8647 348.2964 370.5322 435.2812 436.3183 457.0042 522.6369 542.9288 589.8530 610.0663 655.4594 680.7524 731.2519 753.6675 817.6648 826.2551 858.5996 893.9044 932.4259 939.8083 953.7947 975.4071 992.8133 1039.6795 1089.4811 1111.8151 1113.1550 1132.2118 1142.5884 1152.2887 1155.8067 1164.5391 1189.0695 1206.1435 1229.2535 1249.8767 1289.0395 1313.4867 1328.1508 1350.7134 1370.0627 1397.0556 1422.2371 1436.3153 1442.0282 1445.2346 1453.4731 1455.9590 1458.7197 1460.1043 1475.0801 1478.4392 1489.4064 1578.9995 1600.9606 2955.1307 2969.6621 2971.4468 2973.7263 2988.4622 3014.7149 3054.7229 3057.4426 3066.0590 3068.2315 3117.6970 3119.5831 3122.1834 3161.2460 3425.8867
redmass: 3.3034 3.0735 2.6275 2.6256 2.8119 1.1143 1.0790 3.1758 3.5535 4.9636 3.6146 1.9771 3.7918 3.5712 4.8069 5.5164 5.1440 3.4110 2.8518 4.4095 2.8204 3.1106 2.3668 3.5426 4.0421 1.8916 2.9487 1.9512 4.4875 1.7029 2.5425 1.6972 4.1445 3.3009 3.4620 1.8044 1.2413 1.2386 3.6645 1.5621 1.3734 1.5676 1.1137 4.2555 1.3865 1.6834 2.7711 1.4717 1.4744 1.3278 1.5476 3.4471 2.6726 1.2305 1.3240 1.1798 1.1663 1.1856 1.0588 1.0722 1.0919 1.8254 1.1542 1.0527 7.5380 7.2383 1.0626 1.0311 1.0313 1.0673 1.0651 1.0932 1.0976 1.1008 1.1035 1.1031 1.1026 1.1031 1.0889 1.0954 1.0744
irintensity: 0.7812 5.5777 6.5534 2.7059 0.8354 0.2383 0.1632 5.4535 4.5632 9.9023 5.4643 19.6397 1.3400 3.3784 8.0340 0.2641 3.6620 3.2389 1.1862 10.7259 17.3800 31.7744 114.1734 56.7756 14.0769 11.5830 20.4392 11.1604 22.1035 19.4582 14.7886 9.6822 72.0344 15.3616 48.7069 7.4457 6.8514 3.9113 14.0422 2.8094 0.1290 5.2223 2.5596 29.7601 3.5433 75.0379 52.1327 7.4978 8.1757 15.5986 6.4243 5.1478 36.4660 3.2590 28.1941 20.6882 7.4325 22.9899 15.3827 0.4018 11.0823 63.8383 4.6096 18.3033 3.5965 1.6167 38.1771 93.3264 47.6812 30.6253 41.6718 53.2122 25.0741 38.5004 31.2914 25.6704 27.0849 21.4034 13.9941 10.2525 1.3153
temp: 298.150 k
press: 1.00000 atm
elementType: 8 8 7 6 6 6 6 6 6 6 6 6 6 6 1 1 1 1 1 1 1 1 1 1 1 1 1 1 1
symmnumber: 1
zpe: 632080.7 jmol-1
zpe.correction: 0.240747 hartree
zpe.thermalcorrener: 0.254541 hartree
zpe.thermalcorrenthalpy: 0.255485 hartree
zpe.thermalcorrgfe: 0.200634 hartree
zpe.sumelectzpe: -632.260050 hartree
zpe.sumelectthermal: -632.246256 hartree
zpe.sumelectthermalent: -632.245312 hartree
zpe.sumelectthermalfe: -632.300164 hartree
dipole: 0.3637 0.5316 -0.4763
dipole: 0.8011
quadrupole: -77.9294 -81.8313 -82.2002
quadrupole: -8.7490 5.7286 5.1082
quadrupole: 2.7242 -1.1777 -1.5466 -8.7490 5.7286 5.1082
hfenergy: -632.5007971 hartree
pointgroup: C01 [X(C11H15N1O2)]
dipole: -0.1636282 -0.1903451 -0.1906161 debye
polarizability: 167.6074773|-8.8990606|138.4972495|-3.1921059|4.9428963|84.0780335 unknown
InChI: InChI=1S/C11H15NO2/c1-13-10-4-3-8-5-6-12-7-9(8)11(10)14-2/h3-4,12H,5-7H2,1-2H3
charge 0 multiplicity 1
29 atoms
O  -1.110036 1.8021 0.235515
O  -2.952324 -0.409875 -0.233211
N  3.118792 1.188832 -0.088619
C  2.771125 -1.303684 -0.243213
C  1.265449 -1.038879 -0.236761
C  0.758214 0.270881 -0.008809
C  1.70446 1.448752 0.262122
C  3.56973 -0.137746 0.39552
C  -0.643868 0.484812 -0.019896
C  0.35802 -2.099838 -0.48351
C  -1.545476 -0.595091 -0.224956
C  -1.035201 -1.885894 -0.474637
C  -1.892187 2.407806 -0.868164
C  -3.520575 -0.01615 1.076856
H  2.98617 -2.254474 0.283822
H  3.114652 -1.444372 -1.28977
H  1.353291 2.346489 -0.275644
H  1.651856 1.707136 1.338925
H  3.43821 -0.14981 1.494948
H  4.650347 -0.249832 0.192647
H  3.278296 1.288297 -1.101616
H  0.74997 -3.107427 -0.668417
H  -1.744106 -2.702595 -0.643562
H  -2.777926 1.793358 -1.107652
H  -1.259629 2.515375 -1.770022
H  -2.194172 3.400828 -0.501361
H  -3.353105 -0.818229 1.820687
H  -4.599867 0.113265 0.902651
H  -3.070413 0.926762 1.436927
