program: Gaussian 09
title: 000179616
version: EM64L-G09RevD.01
frameworkgroup: C1[X(C19H14O2)]
method: RPBEPBE
basis: SDD
operation: Freq
keyword: #pfreq=noraman
keyword: PBEPBE/SDD
title: #p freq=noraman PBEPBE/SDD
converged: YES YES NO NO
title: Mulliken charges:
elementType: O O C C C C C C C C C C C C C C C C C C C H H H H H H H H H H H H H H
charge: -0.300300 -0.195719 -0.010302 -0.587640 0.289061 0.287726 0.338105 0.344384 0.345078 0.076874 -0.361878 -0.362272 -0.416551 -0.416870 -0.419762 -0.419996 -0.235859 -0.235662 -0.657659 -0.249474 -0.249316 0.265876 0.265521 0.285369 0.285389 0.216285 0.216285 0.240998 0.241040 0.232558 0.232542 0.234843 0.257244 0.232051 0.232031
chargesum: 0.00000
title: Mulliken charges with hydrogens summed into heavy atoms:
elementType: O O C C C C C C C C C C C C C C C C C C C
charge: -0.300300 -0.195719 -0.010302 -0.056243 0.289061 0.287726 0.338105 0.344384 0.345078 0.076874 -0.076510 -0.076882 -0.200266 -0.200585 -0.178764 -0.178956 -0.003301 -0.003120 -0.165572 -0.017424 -0.017285
polarizability: 2.60757372e+02 -7.45285806e-01 2.04149187e+02 -3.79768415e-01 -2.14903636e+01 1.74488294e+02
1716.lowfreq: -23.1919 -0.0005 -0.0003 -0.0003 3.2365 7.0957 12.0373 50.6793 72.1610
frequency: -22.6775 50.6698 72.1572 100.7861 103.6116 154.6192 170.9291 226.4281 257.6692 281.7427 299.0145 315.5283 338.3135 340.6790 362.2373 383.9225 388.3991 455.8318 477.3258 510.0707 530.4487 540.9622 588.2105 590.9095 594.1435 614.2259 624.0135 656.3365 706.9669 715.4422 732.2814 748.1334 751.7193 775.6631 779.9422 782.1527 811.9530 812.5342 822.0920 875.4618 891.0656 892.9583 934.8569 959.7450 961.3190 966.4341 972.5329 983.4917 993.9154 996.4719 1000.1233 1001.3237 1042.0326 1049.0812 1078.3295 1108.2167 1108.6826 1152.1993 1165.5919 1176.7813 1177.4632 1199.5199 1225.5526 1241.9810 1244.4499 1247.5080 1282.0623 1284.7391 1296.6055 1379.4386 1384.7781 1407.9864 1419.6682 1426.5199 1446.3796 1451.2352 1477.9667 1483.6290 1566.9757 1574.3885 1604.7572 1605.7578 1628.3881 1672.6472 1686.7899 3026.4204 3085.7971 3086.6225 3100.1434 3112.7047 3121.8504 3122.6514 3138.7527 3138.9033 3159.1614 3159.4133 3180.2402 3180.9348 3210.4528
redmass: 4.3178 5.1369 7.4559 3.9949 4.3346 3.3979 3.9746 5.2561 3.8718 3.0882 4.9032 5.8737 3.2254 5.9675 8.1089 5.3440 3.4002 3.0907 4.1395 4.7610 4.1977 4.7698 3.2773 5.4413 1.8157 4.7996 4.2486 6.2404 5.1304 3.7975 2.5184 2.6287 2.1922 2.4870 1.7843 1.8935 2.8961 1.7159 4.7001 2.1421 1.5013 2.0129 2.0987 4.4228 1.3959 1.4640 1.5063 1.3361 2.1691 1.4806 1.8542 2.1522 2.6627 2.1672 4.2161 2.0597 2.5948 1.2634 1.9024 1.0653 1.0724 2.6153 2.0221 1.8977 1.9808 1.7476 1.7279 1.8788 1.4139 9.1312 5.4721 1.6325 1.2083 2.0879 1.0865 2.1241 2.4494 2.9041 7.0430 6.7854 6.1555 6.2634 7.0825 6.7865 11.6243 1.0604 1.1020 1.0851 1.0619 1.0944 1.0873 1.0872 1.0899 1.0899 1.0970 1.0970 1.0953 1.0952 1.1158
irintensity: 0.0046 0.6937 3.8488 0.0022 0.2693 1.6816 0.8045 1.1449 0.4282 0.5871 5.1554 2.6414 0.1777 7.2585 0.7869 0.1334 1.4965 23.8650 5.1529 0.0515 0.4785 1.2222 0.3150 3.0442 3.8411 2.0597 13.1927 7.6806 0.0016 2.9606 6.1077 25.6332 3.6427 38.2004 20.3926 10.8383 12.8604 84.3431 8.9306 1.6635 2.7540 1.7824 31.8120 86.2959 0.6132 7.0202 15.5436 10.4066 35.4623 18.5753 27.7679 44.9572 73.7563 5.5197 157.0695 1.6138 9.7524 0.5968 2.2582 0.5920 0.7130 4.1895 3.1369 8.8897 87.0031 55.6477 6.6215 41.6659 8.7067 2.5862 2.1002 0.6155 21.6871 13.2804 4.9706 7.4986 4.8493 22.9047 1.0379 0.7549 3.0449 0.2988 0.8121 21.7321 258.3030 3.3127 4.0577 0.0611 3.9031 23.2777 2.1238 15.6423 0.7564 28.4552 49.7669 11.2632 13.0086 5.8533 2.3963
temp: 298.150 k
press: 1.00000 atm
elementType: 8 8 6 6 6 6 6 6 6 6 6 6 6 6 6 6 6 6 6 6 6 1 1 1 1 1 1 1 1 1 1 1 1 1 1
symmnumber: 1
zpe: 711897.2 jmol-1
zpe.correction: 0.271147 hartree
zpe.thermalcorrener: 0.286309 hartree
zpe.thermalcorrenthalpy: 0.287253 hartree
zpe.thermalcorrgfe: 0.229482 hartree
zpe.sumelectzpe: -881.424263 hartree
zpe.sumelectthermal: -881.409102 hartree
zpe.sumelectthermalent: -881.408158 hartree
zpe.sumelectthermalfe: -881.465929 hartree
dipole: -0.0613 -3.2779 3.4627
dipole: 4.7685
quadrupole: -108.1627 -128.4081 -114.5935
quadrupole: -0.3667 0.0817 4.0986
quadrupole: 8.8921 -11.3533 2.4612 -0.3667 0.0817 4.0986
hfenergy: -881.6954108 hartree
pointgroup: C01[X(C19H14O2)]
dipole: -0.6450808 1.0963892 -1.3789302 debye
polarizability: 241.1642982|26.9564524|222.7331578|16.8989268|-14.9744833|175.4973964 unknown
InChI: InChI=1S/C19H14O2/c1-13-12-19(21-18(13)20)16-8-4-2-6-14(16)10-11-15-7-3-5-9-17(15)19/h2-11H,1,12H2
charge 0 multiplicity 1
35 atoms
O  0.875902 -1.360222 0.99192
O  2.197414 -3.268777 0.971392
C  0.277805 -0.377468 0.033226
C  0.731307 -0.878191 -1.398664
C  0.851354 1.007065 0.376766
C  -1.248288 -0.429917 0.21309
C  1.566205 -2.112492 -1.136265
C  0.532109 2.13639 -0.443855
C  -2.095938 0.335096 -0.651223
C  1.624488 -2.366545 0.335521
C  1.758453 1.15931 1.451272
C  -1.826595 -1.291843 1.173966
C  -0.483196 2.128856 -1.505432
C  -1.614606 1.352734 -1.595424
C  1.212107 3.366569 -0.198972
C  -3.506003 0.132809 -0.571147
C  2.391083 2.396628 1.699217
C  -3.226943 -1.446688 1.262415
C  2.198993 -2.924165 -2.019175
C  2.129246 3.503486 0.858465
C  -4.07183 -0.743337 0.372532
H  1.311076 -0.095147 -1.914211
H  -0.149235 -1.106133 -2.021498
H  1.980725 0.291597 2.077143
H  -1.166917 -1.858156 1.835881
H  -0.373365 2.924442 -2.255801
H  -2.31205 1.594359 -2.409725
H  0.984005 4.228194 -0.837937
H  -4.156738 0.702472 -1.245499
H  3.098148 2.488909 2.530675
H  -3.653001 -2.12805 2.006727
H  2.166039 -2.752072 -3.100219
H  2.767536 -3.786767 -1.65294
H  2.630596 4.461841 1.031622
H  -5.158386 -0.873386 0.420359
