program: Gaussian 09
title: 000179620
version: EM64L-G09RevD.01
frameworkgroup: C1[X(C15H14O4)]
method: RPBEPBE
basis: SDD
operation: Freq
keyword: #pfreq=noraman
keyword: PBEPBE/SDD
title: #p freq=noraman PBEPBE/SDD
converged: YES YES NO NO
title: Mulliken charges:
elementType: O O O O C C C C C C C C C C C C C C C H H H H H H H H H H H H H H
charge: -0.264930 -0.269852 -0.222911 -0.195363 0.029048 0.088143 0.400926 0.130392 0.177452 0.311233 -0.413045 -0.391153 -0.272863 -0.769767 -0.812407 -0.307679 -0.192214 0.107206 -0.517586 0.244190 0.261803 0.246346 0.271650 0.240312 0.220595 0.273963 0.229523 0.235663 0.254290 0.180493 0.228920 0.255498 0.242123
chargesum: 0.00000
title: Mulliken charges with hydrogens summed into heavy atoms:
elementType: O O O O C C C C C C C C C C C C C C C
charge: -0.264930 -0.269852 -0.222911 -0.195363 0.029048 0.088143 0.400926 0.130392 0.177452 0.311233 -0.168854 -0.129350 -0.026517 -0.037210 -0.073259 -0.053389 -0.011720 0.107206 0.208955
polarizability: 2.36326989e+02 -1.47017469e+01 2.15248519e+02 -1.26809002e+00 -6.80657904e+00 1.12858749e+02
1716.lowfreq: -5.3778 0.0004 0.0005 0.0006 3.2912 9.1727 40.1668 51.3699 64.2920
frequency: 40.0845 51.2244 64.2727 73.0251 86.8894 97.2176 122.6965 125.3818 165.7913 170.5989 192.1764 196.4352 204.6602 228.5731 263.4353 299.7821 301.7253 351.0453 371.8451 401.2320 408.2445 415.7366 434.4475 455.0073 479.4412 519.9481 557.1529 600.4508 618.6147 625.6167 679.3123 689.9874 711.5698 724.6364 773.4381 778.1352 813.7464 844.1366 850.7400 916.0263 927.2146 955.9710 957.6452 979.6387 983.0586 987.5569 1012.4802 1041.1076 1076.4264 1094.4825 1109.5904 1141.8590 1147.2161 1158.2999 1200.3560 1222.2506 1250.4553 1251.2310 1275.9247 1380.2877 1383.3786 1390.2168 1393.5147 1394.5675 1405.9967 1435.9546 1443.6776 1448.3436 1452.7313 1455.2226 1467.2844 1474.1743 1475.3857 1540.5942 1558.2522 1600.7669 1609.8877 1631.6131 1688.8664 2886.3465 2971.2244 2980.0007 2990.0663 3048.1016 3059.4756 3097.2451 3100.0951 3106.3199 3115.9048 3133.9512 3140.3071 3179.7017 3188.7109
redmass: 5.2109 2.9792 3.3623 2.0698 2.7992 5.0668 2.9321 4.0004 4.0500 1.4867 2.3504 2.1412 1.3776 2.5571 5.1460 4.1861 4.8746 4.2474 4.4713 4.2580 4.6054 3.2271 4.1999 7.1171 5.5150 3.5600 4.2107 3.8205 8.6500 4.5491 6.2294 4.2553 4.9427 7.5433 6.9829 5.3131 1.5854 4.8775 1.6161 6.0140 1.4020 2.6264 1.3379 1.5483 1.5277 1.3412 3.7175 3.1113 1.7916 2.4488 1.2340 3.0420 1.4715 1.3825 2.0526 1.8110 2.4643 3.9933 3.6166 3.8902 1.2856 1.8479 1.1834 1.7168 2.8977 1.3815 1.1158 1.0791 1.1091 1.0791 1.0811 1.9849 1.2133 7.5851 6.2359 7.4984 6.9899 6.1902 10.8205 1.0849 1.0375 1.0404 1.0291 1.0961 1.0914 1.0988 1.1051 1.1002 1.1044 1.0907 1.0899 1.0956 1.0954
irintensity: 2.2084 1.0848 0.2970 4.2282 7.4889 0.5488 1.8199 3.2783 4.3527 2.8343 3.5116 1.6022 3.3193 0.1575 3.0347 8.1170 3.3587 3.0480 4.6582 1.8425 1.4552 0.0133 9.7924 14.2817 4.7654 2.6637 0.7772 1.9305 11.2038 6.7830 0.6154 6.1889 17.6058 37.2467 11.9899 12.9054 2.4728 26.1194 85.5472 20.8434 6.0761 28.7953 0.2710 6.6917 5.8243 0.4459 131.3174 4.8437 18.4332 42.6040 4.4488 24.9664 12.0137 0.7097 28.7108 47.6344 27.1918 156.3171 21.6843 86.1860 26.6790 22.7831 17.3953 32.6646 4.3317 7.7142 29.2209 18.4615 13.1735 20.1914 9.8695 8.8290 50.2710 27.6207 184.7619 366.9812 13.2223 54.6193 453.8967 90.8170 6.4585 14.3605 57.0903 11.6866 14.4278 16.4414 22.4308 14.6320 24.2129 9.7492 9.2069 5.1999 2.2090
temp: 298.150 k
press: 1.00000 atm
elementType: 8 8 8 8 6 6 6 6 6 6 6 6 6 6 6 6 6 6 6 1 1 1 1 1 1 1 1 1 1 1 1 1 1
symmnumber: 1
zpe: 658576.6 jmol-1
zpe.correction: 0.250839 hartree
zpe.thermalcorrener: 0.269323 hartree
zpe.thermalcorrenthalpy: 0.270267 hartree
zpe.thermalcorrgfe: 0.204186 hartree
zpe.sumelectzpe: -879.490909 hartree
zpe.sumelectthermal: -879.472425 hartree
zpe.sumelectthermalent: -879.471481 hartree
zpe.sumelectthermalfe: -879.537562 hartree
dipole: 0.6998 4.2862 3.7518
dipole: 5.7391
quadrupole: -106.3553 -113.9508 -113.1267
quadrupole: 12.4605 -11.6350 -4.7664
quadrupole: 4.7889 -2.8065 -1.9825 12.4605 -11.6350 -4.7664
hfenergy: -879.7417479 hartree
pointgroup: C01 [X(C15H14O4)]
dipole: 0.0768039 -1.8871962 1.2372485 debye
polarizability: 232.0635501|-8.8822104|209.9091594|-25.8091731|22.8630106|122.461548 unknown
InChI: InChI=1S/C15H14O4/c1-9(2)11(8-16)14-12(18-3)6-4-10-5-7-13(17)19-15(10)14/h4-8H,1-3H3
charge 0 multiplicity 1
33 atoms
O  -1.279866 1.009365 0.350362
O  2.282785 -2.217729 -0.611198
O  2.749532 1.586044 -2.268266
O  -2.924863 2.552197 0.838999
C  0.53803 -0.484928 -0.131934
C  -0.84735 -0.304388 0.146925
C  -1.781698 -1.382093 0.194469
C  1.425786 0.695198 -0.397204
C  0.967557 -1.830199 -0.337989
C  1.712536 1.666626 0.54913
C  -1.303783 -2.699865 -0.058411
C  0.049368 -2.921739 -0.317339
C  -3.166227 -1.076614 0.4682
C  2.507323 2.916539 0.237259
C  1.241136 1.552381 1.979873
C  -3.595567 0.216405 0.681521
C  1.897248 0.772185 -1.803933
C  -2.676868 1.347317 0.645814
C  3.431038 -1.521338 0.009238
H  -2.007463 -3.539417 -0.036229
H  0.44769 -3.924165 -0.494447
H  -3.886172 -1.902993 0.501315
H  2.261565 3.330078 -0.754065
H  3.591419 2.690614 0.194521
H  2.34512 3.679283 1.018464
H  0.407972 2.262984 2.147126
H  2.05335 1.838597 2.675297
H  0.879253 0.544274 2.238119
H  -4.640601 0.457702 0.889898
H  1.434822 0.00854 -2.477871
H  3.165718 -1.134457 1.00875
H  3.791651 -0.698586 -0.629546
H  4.209061 -2.296015 0.095645
