program: Gaussian 09
title: 000179585
version: EM64L-G09RevD.01
frameworkgroup: C1[X(C14H14O5)]
method: RPBEPBE
basis: SDD
operation: Freq
keyword: #pfreq=noraman
keyword: PBEPBE/SDD
title: #p freq=noraman PBEPBE/SDD
converged: NO YES NO NO
title: Mulliken charges:
elementType: O O O O O C C C C C C C C C C C C C C H H H H H H H H H H H H H H
charge: -0.271709 -0.517856 -0.439578 -0.247680 -0.200123 -0.124584 0.260174 -0.240219 0.201116 0.262086 -0.730556 -0.709103 -0.552608 -0.506578 0.402377 0.202452 -0.268967 -0.313943 0.115130 0.241307 0.246078 0.225649 0.204358 0.272479 0.278107 0.209943 0.210802 0.266158 0.285420 0.363329 0.377187 0.248031 0.251322
chargesum: 0.00000
title: Mulliken charges with hydrogens summed into heavy atoms:
elementType: O O O O O C C C C C C C C C C C C C C
charge: -0.271709 -0.154526 -0.062391 -0.247680 -0.200123 0.116723 0.260174 0.005859 0.201116 0.262086 -0.028071 -0.010251 -0.286450 -0.221158 0.402377 0.202452 -0.020936 -0.062622 0.115130
polarizability: 2.94730222e+02 1.52551935e+00 1.55691469e+02 -1.96633858e+01 5.36534506e-01 9.78290010e+01
1716.lowfreq: -4.2866 -0.0005 -0.0004 -0.0003 6.1015 13.2766 30.0925 55.5768 96.5486
frequency: 29.7916 55.5092 96.5425 98.1762 146.4407 170.2227 198.3923 203.0902 213.0881 231.4168 240.8776 258.2632 285.4691 290.8218 305.2060 316.7924 377.2770 400.9808 408.1510 418.8583 443.5379 459.7140 487.8021 500.1143 528.8449 580.7728 594.7800 640.4502 667.8221 694.1666 707.5097 713.1900 726.3037 749.4700 766.7751 787.0348 809.9886 825.5511 829.4714 859.5733 873.2763 906.8298 914.1401 925.2157 927.3520 974.8573 983.8830 997.8669 1031.1686 1034.3767 1079.2361 1105.4685 1146.1797 1151.0274 1167.4383 1202.5834 1212.8912 1240.6707 1241.2091 1268.3046 1279.2534 1280.1833 1301.6262 1340.4035 1377.3696 1379.4295 1397.6744 1402.8742 1436.9649 1450.3042 1455.0342 1466.5497 1475.8038 1479.0856 1495.0484 1568.8009 1609.3238 1632.2929 1690.1508 2982.1551 2986.2896 3032.6605 3053.8098 3071.8307 3079.4151 3103.3727 3117.4677 3133.4727 3145.6455 3188.3082 3193.4527 3319.1840 3592.8950
redmass: 4.9686 6.1966 4.5339 5.4624 5.6342 6.2990 1.1579 1.0981 3.3637 3.6913 1.4181 4.5834 3.8545 4.8699 3.7336 5.8298 2.5583 4.7234 3.8610 4.2455 3.1461 5.8817 6.4520 5.0157 3.8213 5.8481 5.7685 4.9063 4.7013 3.8421 6.5463 1.2540 6.7335 3.9155 6.2603 4.7239 6.1404 1.7138 3.2588 1.5542 2.3928 2.3802 2.2446 2.0991 1.7742 2.4045 1.3306 1.5000 3.1603 3.4945 4.5292 1.4795 1.9443 1.7879 1.6986 1.9561 1.6971 1.8153 1.4248 1.7828 1.7917 1.3428 1.7016 1.9344 2.0520 1.5648 1.2419 3.3110 1.2172 4.7208 1.0725 1.0534 1.0920 3.6735 1.0675 9.3813 7.5920 8.0275 10.7809 1.0368 1.0383 1.0855 1.0875 1.0986 1.0973 1.1003 1.0987 1.0906 1.0928 1.0952 1.0937 1.0656 1.0667
irintensity: 2.9457 3.5943 0.9702 1.7364 1.2262 2.2879 64.1914 31.1311 9.6256 3.5345 19.8242 1.0026 2.5195 10.8362 2.6872 1.0984 2.6812 4.9472 3.1379 12.6885 5.2751 1.8499 8.2079 8.5915 16.0640 10.1383 5.6247 3.5720 23.7950 8.3289 49.8962 176.3790 3.4203 21.3816 1.4742 12.2493 7.2026 36.4467 33.1836 29.3325 15.8940 72.9848 52.2558 36.8372 1.7598 44.8890 1.1308 33.4842 31.6122 43.1266 305.2145 87.8156 10.8198 19.7679 34.3671 12.8264 30.5337 7.7173 1.3164 35.8628 55.2301 10.8878 15.6079 39.5013 59.5656 39.0067 28.4830 16.9068 64.6493 7.2536 9.7724 3.8645 9.6008 82.2049 28.5422 125.7159 17.4311 532.5265 480.3651 11.9883 46.0448 13.3072 39.0440 0.8165 54.1306 4.3942 13.8175 9.8119 3.4490 2.3383 0.4334 186.2573 10.4271
temp: 298.150 k
press: 1.00000 atm
elementType: 8 8 8 8 8 6 6 6 6 6 6 6 6 6 6 6 6 6 6 1 1 1 1 1 1 1 1 1 1 1 1 1 1
symmnumber: 1
zpe: 664049.1 jmol-1
zpe.correction: 0.252923 hartree
zpe.thermalcorrener: 0.269780 hartree
zpe.thermalcorrenthalpy: 0.270724 hartree
zpe.thermalcorrgfe: 0.209145 hartree
zpe.sumelectzpe: -916.617858 hartree
zpe.sumelectthermal: -916.601001 hartree
zpe.sumelectthermalent: -916.600057 hartree
zpe.sumelectthermalfe: -916.661636 hartree
dipole: 7.5844 1.8458 0.0382
dipole: 7.8058
quadrupole: -119.1109 -114.1080 -105.2934
quadrupole: -26.3136 4.1180 -2.1806
quadrupole: -6.2734 -1.2706 7.5440 -26.3136 4.1180 -2.1806
hfenergy: -916.8707808 hartree
pointgroup: C01 [X(C14H14O5)]
dipole: 2.9575998 0.823035 -0.0808046 debye
polarizability: 292.5625693|6.7469473|155.8949473|-27.4331214|1.3809317|99.7931752 unknown
InChI: InChI=1S/C14H14O5/c1-14(2,17)13-12(16)8-5-7-3-4-11(15)18-9(7)6-10(8)19-13/h3-6,12-13,16-17H,1-2H3
charge 0 multiplicity 1
33 atoms
O  1.65832 -1.15085 -0.942275
O  3.161777 -0.033762 1.367044
O  2.392527 2.205365 0.243194
O  -3.093184 -1.319865 0.031039
O  -5.35072 -1.431132 0.509767
C  2.682633 -0.043848 -0.995956
C  3.79423 -0.342121 0.042226
C  1.887511 1.318616 -0.800351
C  0.463722 0.832513 -0.563481
C  0.417846 -0.582606 -0.649918
C  4.204045 -1.827115 0.01806
C  5.01067 0.583965 -0.185851
C  -0.693296 1.548946 -0.263113
C  -0.754965 -1.326175 -0.459738
C  -1.918227 0.844808 -0.05536
C  -1.920131 -0.586263 -0.163198
C  -3.167316 1.494859 0.263584
C  -4.329018 0.776806 0.459047
C  -4.371076 -0.678132 0.356272
H  3.123307 -0.101882 -2.006193
H  1.959014 1.926574 -1.718753
H  4.600046 -2.111994 -0.972961
H  5.003273 -2.011909 0.76146
H  3.338532 -2.471376 0.238002
H  4.711118 1.643488 -0.133916
H  5.471189 0.389245 -1.172063
H  5.778906 0.39248 0.585668
H  -0.666714 2.640319 -0.171828
H  -0.785695 -2.415352 -0.52409
H  3.662572 -0.483148 2.09092
H  2.561126 1.629804 1.049497
H  -3.181178 2.587772 0.351253
H  -5.27804 1.260873 0.701611
