program: Gaussian 09
title: 000179617
version: EM64L-G09RevD.01
frameworkgroup: C1[X(C19H16O2)]
method: RPBEPBE
basis: SDD
operation: Freq
keyword: #pfreq=noraman
keyword: PBEPBE/SDD
title: #p freq=noraman PBEPBE/SDD
converged: YES YES NO NO
title: Mulliken charges:
elementType: O O C C C C C C C C C C C C C C C C C C C H H H H H H H H H H H H H H H H
charge: -0.291535 -0.192027 0.057567 0.245544 0.233357 -0.615554 0.345045 0.268559 -0.642657 -0.541287 0.353341 -0.362846 -0.345105 0.052964 -0.438079 -0.352083 -0.241520 -0.252040 -0.237586 -0.258687 -0.673548 0.254340 0.261710 0.238896 0.220179 0.242827 0.224994 0.287227 0.275364 0.234888 0.232332 0.230667 0.231998 0.228021 0.230094 0.235565 0.259075
chargesum: 0.00000
title: Mulliken charges with hydrogens summed into heavy atoms:
elementType: O O C C C C C C C C C C C C C C C C C C C
charge: -0.291535 -0.192027 0.057567 0.245544 0.233357 -0.099504 0.345045 0.268559 -0.183582 -0.073465 0.353341 -0.075619 -0.069741 0.052964 -0.203191 -0.119751 -0.010853 -0.020042 -0.009564 -0.028593 -0.178908
polarizability: 2.32057972e+02 6.00905353e+00 2.04663788e+02 5.30329934e+00 1.51184970e+01 1.64503132e+02
1716.lowfreq: -14.3627 -8.3220 -0.0009 -0.0008 -0.0004 1.2206 24.1791 37.4368 73.1384
frequency: 23.2290 37.4096 73.1369 79.1782 103.9830 134.5259 171.8877 196.6094 254.3122 275.4617 290.3255 306.7680 316.0038 325.0613 343.7881 361.5619 392.7020 441.5613 457.3466 474.0865 505.9098 532.2670 550.4656 586.6165 592.6932 595.5183 615.5071 625.9194 654.4878 709.8000 723.9778 741.6425 753.9973 766.4617 771.4805 776.6675 781.7261 811.8573 828.2066 875.3249 887.4314 908.2309 932.1966 949.3763 955.2617 961.2201 975.8394 976.6355 989.5585 995.6478 998.6697 1005.7880 1033.5641 1048.1606 1061.7680 1076.6707 1103.0931 1108.8596 1152.4265 1166.2048 1175.7681 1178.5642 1186.9033 1194.4222 1219.4030 1230.2981 1232.0497 1251.6923 1282.4222 1283.0395 1296.0947 1328.2225 1355.6705 1377.8134 1380.5756 1420.3141 1429.2487 1437.2801 1445.7926 1451.1072 1480.2014 1483.5525 1488.1991 1583.0324 1591.6231 1607.5985 1611.8740 1675.0711 1684.2620 2961.6035 3001.8347 3004.7786 3017.0474 3056.6661 3084.6807 3099.9916 3110.8845 3116.8660 3135.5036 3136.2592 3156.8726 3157.7779 3183.2518 3185.8283 3210.3762
redmass: 4.2978 4.4975 7.5955 4.0991 3.9647 3.0626 3.9639 3.0535 4.3637 4.0844 3.4885 4.4179 3.7175 5.6633 3.3192 5.8928 3.9433 2.7142 3.0390 4.1887 4.0791 4.1288 4.1303 2.8108 3.8010 2.2853 4.6622 3.5868 6.2651 4.8255 2.9572 5.1636 2.6600 1.7374 2.1880 1.6141 2.0039 4.7266 2.9194 1.3660 1.3797 2.2686 2.6714 3.3762 1.4639 1.4662 1.5311 2.0468 2.1260 1.5725 1.5246 2.4612 2.8832 2.3914 2.4855 3.7009 2.3802 2.0620 1.3531 1.2936 1.0834 1.1929 2.0165 1.7222 1.9826 1.9988 1.4028 2.0449 1.9758 1.6327 1.3318 1.5517 2.3853 2.4949 6.6334 1.1787 2.1515 2.2146 1.1490 1.0942 2.1814 2.3513 1.1574 6.6275 7.0081 6.1507 6.3549 6.8616 11.5693 1.0609 1.0715 1.0646 1.0869 1.0997 1.0998 1.0618 1.0878 1.0874 1.0897 1.0891 1.0974 1.0973 1.0948 1.0940 1.1158
irintensity: 0.1159 0.0876 3.8360 0.0636 0.7262 1.0190 0.8350 2.0759 0.1539 2.3446 2.2388 1.3007 0.6598 5.3124 1.1323 1.8563 0.2513 7.4699 1.9502 4.8813 2.2964 1.0115 0.3123 8.3835 4.1558 3.4822 2.7368 17.4473 6.4225 6.8255 7.6966 2.3276 14.6206 15.5745 17.9778 85.3558 10.2434 7.9078 8.4334 0.5669 0.9699 8.5045 56.7179 59.4332 2.3164 3.6542 19.4995 10.4525 28.8813 8.4600 24.0400 36.5334 4.8037 66.0344 37.5539 131.0279 8.7335 4.4289 0.2314 2.0659 4.4422 0.3472 7.5733 0.1493 18.9869 28.9570 30.2644 41.8025 60.9690 14.7961 4.4436 0.7674 0.7716 3.6376 0.1542 22.9215 9.4140 3.8584 10.5614 13.2774 26.3245 15.1675 17.0938 1.3163 0.7496 0.8946 2.2261 21.9386 253.2785 22.8726 8.4141 13.2400 52.0595 27.1813 9.1480 3.9794 10.9837 7.4644 14.4659 12.7450 36.0058 26.4699 7.3140 7.9055 2.3509
temp: 298.150 k
press: 1.00000 atm
elementType: 8 8 6 6 6 6 6 6 6 6 6 6 6 6 6 6 6 6 6 6 6 1 1 1 1 1 1 1 1 1 1 1 1 1 1 1 1
symmnumber: 1
zpe: 772359.3 jmol-1
zpe.correction: 0.294176 hartree
zpe.thermalcorrener: 0.310745 hartree
zpe.thermalcorrenthalpy: 0.311689 hartree
zpe.thermalcorrgfe: 0.249548 hartree
zpe.sumelectzpe: -882.599287 hartree
zpe.sumelectthermal: -882.582717 hartree
zpe.sumelectthermalent: -882.581773 hartree
zpe.sumelectthermalfe: -882.643915 hartree
dipole: 1.8000 3.0801 4.0266
dipole: 5.3796
quadrupole: -115.8859 -123.8698 -117.6805
quadrupole: -5.4624 -3.7101 -3.9965
quadrupole: 3.2595 -4.7244 1.4649 -5.4624 -3.7101 -3.9965
hfenergy: -882.8934627 hartree
pointgroup: C01 [X(C19H16O2)]
dipole: -0.605475 1.208809 -1.6284181 debye
polarizability: 231.1088807|-6.8090438|204.601201|6.4097199|-16.4626918|165.5148106 unknown
InChI: InChI=1S/C19H16O2/c1-13-12-19(21-18(13)20)16-8-4-2-6-14(16)10-11-15-7-3-5-9-17(15)19/h2-9H,1,10-12H2
charge 0 multiplicity 1
37 atoms
O  0.705051 -1.443348 0.967134
O  2.175602 -3.239187 1.047802
C  0.169689 -0.447927 -0.024994
C  -1.354611 -0.41288 0.184736
C  0.880225 0.906424 0.241573
C  0.591544 -1.056766 -1.428364
C  -2.184933 0.342279 -0.692236
C  0.46085 2.146464 -0.334856
C  -1.587177 1.22714 -1.772728
C  -0.793748 2.414023 -1.178883
C  1.608979 -2.12748 -1.101035
C  -1.944953 -1.153255 1.237031
C  2.039436 0.894113 1.065557
C  1.578476 -2.382717 0.371193
C  -3.587944 0.316813 -0.50121
C  1.24382 3.305863 -0.075047
C  -3.345766 -1.16387 1.418621
C  2.793491 2.057782 1.313907
C  -4.175207 -0.431728 0.542577
C  2.396686 3.279919 0.731062
C  2.444185 -2.805351 -1.925753
H  1.007031 -0.281616 -2.090986
H  -0.293168 -1.501765 -1.91966
H  -0.941983 0.652948 -2.460845
H  -2.403367 1.641995 -2.392572
H  -1.494605 2.998962 -0.547892
H  -0.501485 3.086157 -2.009936
H  -1.299145 -1.722244 1.909438
H  2.340535 -0.040677 1.542509
H  -4.224214 0.897414 -1.180557
H  0.922354 4.256739 -0.519562
H  -3.782093 -1.744357 2.238843
H  3.677877 2.005937 1.957973
H  -5.263309 -0.439406 0.670714
H  2.969936 4.197009 0.90551
H  2.479979 -2.621254 -3.004759
H  3.112761 -3.569052 -1.512109
