program: Gaussian 09
title: 000179600
version: EM64L-G09RevD.01
frameworkgroup: C1[X(C19H23N3O)]
method: RPBEPBE
basis: SDD
operation: Freq
keyword: #p
keyword: freq=noraman
keyword: PBEPBE/SDD
title: #p freq=noraman PBEPBE/SDD
converged: YES YES NO NO
title: Mulliken charges:
elementType: O N N N C C C C C C C C C C C C C C C C C C C H H H H H H H H H H H H H H H H H H H H H H H
charge: -0.284850 -0.169872 -0.132283 -0.099062 -0.360943 0.332776 -0.420788 0.051209 -0.585239 0.116966 -0.349141 -0.352172 0.490980 -0.343551 -0.210187 -0.249210 -0.377380 -0.441650 -0.646734 -0.605525 -0.228593 -0.218147 -0.241397 0.218996 0.282063 0.244201 0.228663 0.246930 0.255162 0.190142 0.208811 0.236357 0.262580 0.225334 0.229588 0.257587 0.234851 0.285046 0.182676 0.215495 0.185674 0.218818 0.222673 0.231480 0.229636 0.232030
chargesum: 0.00000
title: Mulliken charges with hydrogens summed into heavy atoms:
elementType: O N N N C C C C C C C C C C C C C C C C C C C
charge: -0.284850 -0.169872 -0.132283 -0.099062 0.140116 0.332776 0.052076 0.051209 -0.083147 0.116966 0.049812 -0.115815 0.490980 -0.080971 0.015147 -0.019622 -0.119793 -0.206798 0.036483 0.021640 0.002887 0.011488 -0.009367
polarizability: 2.83882712e+02 2.93459505e+01 2.43515664e+02 -1.47498960e+01 1.90422308e-01 1.61610297e+02
1716.lowfreq: -8.9022 -4.5642 -0.0004 -0.0002 0.0003 4.9993 18.4705 22.6794 32.9237
frequency: 18.3532 22.4166 32.8973 34.5511 40.8595 51.8206 82.0073 103.8329 129.8761 152.0384 175.2086 198.6884 211.9206 218.1388 230.0917 272.4145 290.0941 291.8943 302.8743 320.2224 331.1447 341.4660 387.8716 403.7211 419.5375 428.3330 456.0133 477.2339 535.1096 545.9689 558.6457 591.8347 613.8199 621.9979 657.5192 665.2860 702.9827 710.8404 730.7392 748.4002 752.9239 767.0123 781.1273 802.6522 820.8795 857.2022 860.0606 876.7701 886.4307 920.8560 951.4559 958.2694 982.2137 983.8044 990.1112 993.5380 1001.1799 1006.8462 1019.8054 1026.1551 1040.1186 1053.2325 1072.7813 1081.8663 1084.8674 1091.8157 1101.8361 1134.8010 1139.4680 1165.8622 1172.9583 1185.1593 1188.6312 1201.8917 1206.3682 1228.5750 1247.0809 1264.8669 1269.0417 1272.0891 1299.5815 1308.3758 1315.4390 1323.6236 1351.7193 1360.3280 1365.4763 1368.0592 1388.1447 1411.9985 1420.3132 1441.7248 1443.1532 1452.0535 1457.9330 1458.7876 1460.8463 1465.1111 1470.7783 1473.7442 1476.6807 1483.9834 1486.9058 1497.0896 1592.5543 1595.8046 1614.9869 1617.3911 1628.5144 2824.8913 2843.8272 2861.1316 2971.4793 2995.8918 3004.8178 3014.5096 3026.2347 3030.4370 3031.6501 3058.6872 3074.2809 3084.7748 3092.9927 3114.2489 3125.8735 3129.7291 3137.4675 3143.9648 3148.2489 3154.4078 3165.1664 3170.2571
redmass: 4.2662 3.9542 4.6458 3.8200 3.4397 4.3217 3.2089 3.7622 4.6550 5.7121 4.6572 4.0554 1.7221 4.1447 1.1719 1.5750 2.7659 2.3886 3.4254 2.7666 3.6620 2.0086 4.6909 2.8442 2.3782 2.8822 2.9366 4.0177 4.1793 5.2590 5.7468 4.5871 6.0785 4.4714 5.3198 5.3617 3.1419 2.3164 1.7679 1.8295 1.8507 2.2932 2.7786 3.4526 3.3441 1.3814 1.2688 1.8281 2.7356 1.5470 1.3760 2.4596 1.3899 1.3188 5.4898 2.0535 1.7726 2.7560 1.9523 2.1452 1.5407 2.3286 2.3175 1.8488 1.6021 1.6107 1.9706 1.8714 1.5086 1.2054 1.0557 1.1187 1.9919 2.4028 2.2311 1.5287 1.7040 1.7554 2.7647 2.0078 1.6841 1.4201 1.2348 1.4191 1.4778 1.5799 1.7385 1.6951 4.5313 5.7449 1.1442 2.0028 1.1710 1.1250 1.2635 2.1885 1.0533 1.0913 3.0741 1.0928 1.0600 2.1968 1.0561 1.0551 7.4371 6.1882 6.3229 9.4005 8.0573 1.0699 1.0574 1.0567 1.0614 1.0848 1.0627 1.0714 1.0629 1.0742 1.0974 1.1001 1.1009 1.1014 1.1036 1.0880 1.0859 1.0858 1.0909 1.0895 1.0959 1.0952 1.1014 1.1001
irintensity: 0.6810 1.2374 1.6834 0.2376 0.4803 0.5490 1.0203 0.1013 1.5796 3.2738 0.6892 2.7013 0.3589 2.3738 0.1079 1.6660 11.1678 0.1224 9.5075 7.2496 5.1887 3.5995 23.5183 0.1682 1.2813 3.5654 8.1229 11.5933 10.8026 9.2431 5.2256 0.9686 0.3763 3.9570 20.3915 15.2048 6.2383 49.3614 22.2497 45.2009 58.4458 18.5605 4.8402 12.4276 16.3717 0.7902 0.1930 8.7814 3.9418 4.1992 1.3232 19.7711 0.2210 0.2147 0.7954 12.5358 15.4357 4.2308 4.5155 6.4359 19.5106 7.2372 2.9229 14.7927 9.1878 6.7950 0.5038 20.0750 8.6011 12.5773 0.2885 3.9584 2.5264 3.0436 2.4129 21.0005 4.2848 3.7071 124.3446 17.9068 62.9793 3.1430 1.4466 8.6859 26.1184 1.8957 14.6855 5.1275 5.4293 30.6081 1.8995 21.6132 1.4925 24.3765 12.1349 30.6938 13.6442 29.7342 66.9512 20.8165 13.2903 14.2520 3.2105 16.5358 0.7886 1.3969 53.7254 247.9943 143.3600 62.6043 92.1374 253.3728 26.7941 23.6533 17.5958 44.6329 21.3928 25.0222 8.3359 19.2402 34.4951 17.6083 15.2026 8.1294 1.1219 3.7231 10.0987 10.0889 31.8335 16.9907 24.8384 25.5033
temp: 298.150 k
press: 1.00000 atm
elementType: 8 7 7 7 6 6 6 6 6 6 6 6 6 6 6 6 6 6 6 6 6 6 6 1 1 1 1 1 1 1 1 1 1 1 1 1 1 1 1 1 1 1 1 1 1 1
symmnumber: 1
zpe: 1003591.2 jmol-1
zpe.correction: 0.382248 hartree
zpe.thermalcorrener: 0.403859 hartree
zpe.thermalcorrenthalpy: 0.404803 hartree
zpe.thermalcorrgfe: 0.328901 hartree
zpe.sumelectzpe: -975.584104 hartree
zpe.sumelectthermal: -975.562493 hartree
zpe.sumelectthermalent: -975.561549 hartree
zpe.sumelectthermalfe: -975.637451 hartree
dipole: 0.7506 5.0489 0.3455
dipole: 5.1160
quadrupole: -121.2141 -141.3249 -133.9194
quadrupole: -0.5477 -0.6433 -4.4863
quadrupole: 10.9387 -9.1722 -1.7666 -0.5477 -0.6433 -4.4863
hfenergy: -975.9663519 hartree
pointgroup: C01 [X(C19H23N3O1)]
dipole: -0.5794419 -1.9275239 0.0162532 debye
polarizability: 291.34522|21.4039413|235.9681816|16.2707701|2.3030073|161.695271 unknown
InChI: InChI=1S/C19H23N3O/c1-20(2)13-8-14-21-19(23)17-11-6-7-12-18(17)22(21)15-16-9-4-3-5-10-16/h3-7,9-12H,8,13-15H2,1-2H3
charge 0 multiplicity 1
46 atoms
O  1.010152 3.046399 -0.175069
N  0.393783 0.788059 -0.577695
N  0.983206 -0.515792 -0.388996
N  -3.307717 2.83972 0.047136
C  -1.061157 0.998969 -0.572387
C  2.344941 -0.292298 -0.11582
C  -1.656001 1.10422 0.850597
C  2.583962 1.106307 0.008961
C  0.494689 -1.628043 -1.22829
C  1.316247 1.813998 -0.245669
C  -3.121445 1.587643 0.82092
C  3.388712 -1.232667 0.054319
C  -0.673302 -2.408678 -0.626878
C  3.863802 1.594443 0.343185
C  4.667241 -0.730004 0.375269
C  4.909766 0.66654 0.525344
C  -0.75386 -2.633386 0.76942
C  -1.660693 -2.967876 -1.473959
C  -2.5437 3.987375 0.58815
C  -4.738302 3.159884 -0.127333
C  -1.802564 -3.410539 1.309083
C  -2.70996 -3.747685 -0.936136
C  -2.783275 -3.972031 0.457841
H  -1.554235 0.196781 -1.148885
H  -1.24052 1.949233 -1.10287
H  -1.034282 1.802697 1.439624
H  -1.616108 0.120917 1.355785
H  1.354523 -2.309269 -1.372483
H  0.227242 -1.244839 -2.233705
H  -3.479225 1.699191 1.879398
H  -3.755367 0.809696 0.350031
H  3.220613 -2.311101 -0.034338
H  4.023498 2.672488 0.447881
H  5.493424 -1.435226 0.520881
H  5.915615 1.013873 0.782732
H  0.001766 -2.186661 1.425999
H  -1.611968 -2.793349 -2.556557
H  -1.458246 3.796531 0.533702
H  -2.812919 4.226751 1.648848
H  -2.752025 4.880766 -0.027077
H  -5.264941 3.383907 0.836388
H  -5.256758 2.310039 -0.607749
H  -4.844656 4.041898 -0.783986
H  -1.855678 -3.577959 2.390738
H  -3.469678 -4.173574 -1.600999
H  -3.597296 -4.574146 0.876445
