program: Gaussian 09
title: 000179733
version: EM64L-G09RevD.01
frameworkgroup: C1[X(C16H23NO2)]
method: RPBEPBE
basis: SDD
operation: Freq
keyword: #p
keyword: freq=noraman
keyword: PBEPBE/SDD
title: #p freq=noraman PBEPBE/SDD
converged: NO YES NO NO
title: Mulliken charges:
elementType: O O N C C C C C C C C C C C C C C C C H H H H H H H H H H H H H H H H H H H H H H H
charge: -0.182905 -0.291931 -0.109730 -0.338249 0.303275 0.274056 -0.403704 -0.652220 -0.574850 -0.575890 0.087597 -0.042547 -0.371156 -0.368048 -0.388261 -0.426693 -0.508298 0.236888 -0.735392 0.239549 0.235397 0.188266 0.205166 0.196496 0.251000 0.277956 0.199829 0.211402 0.256496 0.194074 0.263195 0.213123 0.207431 0.193518 0.244523 0.205002 0.221121 0.189654 0.224399 0.224950 0.219837 0.205673
chargesum: 0.00000
title: Mulliken charges with hydrogens summed into heavy atoms:
elementType: O O N C C C C C C C C C C C C C C C C
charge: -0.182905 -0.291931 -0.109730 -0.098699 0.303275 0.274056 0.019959 -0.123264 -0.173188 -0.164660 0.087597 0.213949 0.086113 0.052506 0.049780 -0.000570 -0.094245 0.236888 -0.084932
polarizability: 1.93766661e+02 1.14803859e+01 1.70045434e+02 -2.00635025e-01 -1.29157440e+01 1.52203226e+02
1716.lowfreq: -10.7542 -8.5048 -0.0004 -0.0002 0.0007 11.2107 52.3929 64.1298 89.9771
frequency: 52.2821 64.0937 89.9638 116.1605 138.3499 168.2308 186.3965 208.8254 216.0973 227.0135 233.5103 253.7287 279.6862 309.1406 320.0714 345.7288 361.4190 372.9409 381.7371 409.8143 430.0946 442.3986 467.1160 479.9354 484.2363 537.3451 568.0545 584.0815 617.4417 644.2284 646.2479 723.5210 752.3022 766.9218 798.3103 829.2759 834.9195 844.8504 852.6841 864.7480 909.5681 916.0479 927.1910 938.1346 952.5903 954.9577 979.2309 1010.5192 1034.0522 1042.9315 1059.3728 1078.8335 1094.6047 1101.5927 1107.8120 1127.1352 1136.4788 1147.9740 1172.8385 1180.6761 1189.0175 1199.8259 1206.2339 1221.5079 1237.7199 1241.2115 1259.7811 1274.2087 1278.8259 1280.9266 1289.5081 1309.9622 1319.0350 1325.2769 1334.1178 1339.1481 1340.7000 1349.2703 1357.3416 1362.1786 1370.3868 1388.7755 1413.9250 1419.5087 1441.8695 1448.2157 1453.6468 1454.6901 1466.6554 1472.9974 1476.2071 1477.2539 1479.7004 1484.1332 1557.0171 1653.5540 1671.8336 2938.4714 2950.6709 2958.3367 2966.4785 2967.4088 2967.8201 2975.3975 2986.1338 2991.4226 2995.2228 2996.2000 2999.4799 3015.1963 3015.7359 3020.4270 3030.0671 3047.8803 3051.9471 3056.4743 3063.6991 3071.1487 3072.7344 3091.5136
redmass: 3.4534 5.6855 3.5118 4.9856 3.1825 4.6529 3.9078 2.7929 1.2631 2.4256 3.5962 2.0206 2.9379 2.9008 2.4155 2.3552 3.0149 2.7925 2.4155 2.8569 2.3766 2.6874 2.1984 2.8418 2.5103 3.7721 2.8816 4.2375 3.2603 3.6706 4.0677 3.4700 3.2845 2.4962 2.5964 1.9736 2.0049 2.0694 1.6717 2.4109 2.0170 1.8713 2.2116 2.2272 2.7468 1.8744 2.2824 2.4587 1.8768 1.7797 1.9754 2.5379 2.3497 2.0660 1.8799 1.4106 2.0937 1.7131 2.2169 1.6152 1.9999 1.6379 1.2561 1.3643 1.5429 1.6243 1.2756 1.2981 1.2922 1.3314 1.7990 1.3962 1.6990 1.4246 1.4767 1.4032 1.5089 1.3963 1.3008 1.6910 1.3689 1.2103 2.0319 1.0858 1.1145 1.0884 1.1814 1.1969 1.0959 1.0837 1.0491 1.0890 1.0634 1.0957 5.6778 8.8815 10.3517 1.0800 1.0636 1.0591 1.0606 1.0384 1.0685 1.0643 1.0617 1.0647 1.0714 1.0696 1.0691 1.0970 1.0968 1.0963 1.1011 1.1020 1.0963 1.0994 1.0986 1.0955 1.0995 1.0903
irintensity: 0.9919 0.1216 5.6228 8.2743 1.6216 0.1061 1.1663 1.1218 0.2214 2.2754 0.0817 0.7621 2.9831 1.1341 1.2181 3.8404 10.4733 2.8313 1.7783 1.5866 2.4597 1.8608 5.0957 4.9667 3.4873 2.3863 0.2139 11.4370 1.9334 4.5725 3.2708 0.7640 0.0316 2.6526 8.5171 0.9512 2.0251 4.4552 4.1059 6.7627 2.8450 2.1304 0.9888 2.3406 11.5543 0.5079 9.4598 5.5496 9.5550 4.8199 1.9880 0.8745 1.3797 0.8433 5.0501 12.0045 14.5237 18.6504 51.9170 1.3216 5.5130 15.7951 1.2762 11.3263 10.8347 8.6707 4.0300 3.1258 4.1269 22.8985 10.2401 2.4794 3.6761 2.4168 0.4625 21.7132 10.0889 0.4518 1.4998 2.5448 17.6050 12.3871 61.3940 22.0842 7.1194 7.0809 23.0139 10.0011 15.8349 13.8726 10.8249 23.8909 15.8284 19.7684 176.8663 97.4385 79.9906 15.5966 27.6925 38.9019 16.4319 54.4315 27.8996 20.0764 27.0008 63.3262 25.3349 94.0487 19.3201 6.5891 24.4897 17.4109 38.3864 10.3795 18.4631 3.9830 62.3226 33.5211 36.2666 41.4951
temp: 298.150 k
press: 1.00000 atm
elementType: 8 8 7 6 6 6 6 6 6 6 6 6 6 6 6 6 6 6 6 1 1 1 1 1 1 1 1 1 1 1 1 1 1 1 1 1 1 1 1 1 1 1
symmnumber: 1
zpe: 950148.8 jmol-1
zpe.correction: 0.361893 hartree
zpe.thermalcorrener: 0.379139 hartree
zpe.thermalcorrenthalpy: 0.380083 hartree
zpe.thermalcorrgfe: 0.318833 hartree
zpe.sumelectzpe: -827.239750 hartree
zpe.sumelectthermal: -827.222504 hartree
zpe.sumelectthermalent: -827.221560 hartree
zpe.sumelectthermalfe: -827.282810 hartree
dipole: 2.0596 -3.9308 4.1726
dipole: 6.0913
quadrupole: -115.8141 -114.1586 -120.3786
quadrupole: 11.8731 -0.0851 0.4972
quadrupole: 0.9697 2.6251 -3.5948 11.8731 -0.0851 0.4972
hfenergy: -827.6016429 hartree
pointgroup: C01 [X(C16H23N1O2)]
dipole: 0.9284479 1.256218 -1.817457 debye
polarizability: 189.6555323|-15.4029091|171.5495753|-2.4974737|-13.6464023|154.8102131 unknown
InChI: InChI=1S/C16H23NO2/c1-11-8-12-10-15(18)14-5-3-7-17(16(19)9-11)6-2-4-13(12)14/h11,14H,2-10H2,1H3
charge 0 multiplicity 1
42 atoms
O  -3.035792 -2.23476 0.94363
O  1.000333 0.509217 2.181705
N  0.438911 1.857979 0.386561
C  -2.100814 -0.528628 -0.604013
C  -0.684087 -0.469938 -1.173787
C  0.135409 -1.406022 -0.596755
C  -2.682922 0.707803 0.166075
C  -0.595357 -2.226364 0.456272
C  1.597811 -1.670666 -0.875399
C  -0.335718 0.455336 -2.324073
C  -2.045661 -1.745402 0.350074
C  2.570931 -1.137796 0.226569
C  -1.872762 1.226899 1.382863
C  -0.368775 1.981206 -2.023384
C  -0.767803 2.290873 1.144651
C  0.642144 2.453619 -0.951514
C  2.54444 0.416546 0.321855
C  1.272423 0.935632 1.007093
C  4.008041 -1.631401 -0.052689
H  -2.835199 -0.750115 -1.410704
H  -3.673389 0.373523 0.533868
H  -2.883641 1.53122 -0.546634
H  1.757542 -2.76566 -0.958892
H  1.906623 -1.234726 -1.846369
H  -0.526402 -3.321023 0.297412
H  -0.221453 -2.035308 1.483869
H  0.66385 0.199892 -2.725726
H  -1.055548 0.270778 -3.150228
H  2.246143 -1.5257 1.211771
H  -2.590992 1.707551 2.078357
H  -1.42636 0.389372 1.946029
H  -0.140871 2.529009 -2.960197
H  -1.388135 2.287148 -1.727734
H  -1.193239 3.162461 0.612029
H  -0.428066 2.630505 2.141856
H  1.666093 2.237984 -1.29406
H  0.567421 3.556564 -0.856135
H  2.730097 0.838818 -0.68102
H  3.384848 0.732943 0.969902
H  4.70341 -1.301919 0.741169
H  4.046219 -2.735581 -0.098574
H  4.386901 -1.242271 -1.018225
