program: Gaussian 09
title: 000179611
version: EM64L-G09RevD.01
frameworkgroup: C1[X(C17H26O10)]
method: RPBEPBE
basis: SDD
operation: Freq
keyword: #p
keyword: freq=noraman
keyword: PBEPBE/SDD
title: #p freq=noraman PBEPBE/SDD
converged: NO YES NO NO
title: Mulliken charges:
elementType: O O O O O O O O O O C C C C C C C C C C C C C C C C C H H H H H H H H H H H H H H H H H H H H H H H H H H
charge: -0.380665 -0.309330 -0.242849 -0.228540 -0.442935 -0.467758 -0.502354 -0.453363 -0.436434 -0.242714 -0.279481 0.388752 -0.093226 -0.476898 -0.509086 -0.049364 -0.765644 -0.256968 -0.104996 -0.159285 -0.200338 -0.156141 0.254272 -0.134517 0.319051 -0.358845 -0.791681 0.284188 0.242349 0.213590 0.267697 0.242919 0.222947 0.252638 0.262174 0.244551 0.238049 0.229387 0.261178 0.271071 0.237435 0.250847 0.233808 0.218392 0.220486 0.365841 0.369796 0.433782 0.369399 0.251558 0.289604 0.245838 0.361813
chargesum: 0.00000
title: Mulliken charges with hydrogens summed into heavy atoms:
elementType: O O O O O O O O O O C C C C C C C C C C C C C C C C C
charge: -0.380665 -0.309330 -0.242849 -0.228540 -0.077094 -0.097962 -0.068572 -0.083963 -0.074621 -0.242714 0.004707 0.388752 0.149123 0.004390 -0.043220 0.203274 -0.020869 -0.027582 0.156182 0.078150 0.070733 0.094706 0.254272 0.099291 0.319051 0.080032 -0.004681
polarizability: 2.37983005e+02 -5.74698635e+00 2.05410445e+02 4.87869161e+00 4.00919349e+00 1.85739149e+02
1716.lowfreq: -7.7942 -0.0001 0.0005 0.0009 6.1574 10.5272 28.0528 37.7296 57.5737
frequency: 27.9630 37.6911 57.5515 65.4793 69.4397 87.7347 89.7893 101.5266 109.7723 111.1843 122.7976 131.7938 146.9754 154.9180 172.0887 191.7569 197.4489 220.4539 223.1274 238.3548 246.2142 274.6092 290.1005 296.9879 312.5112 319.1815 335.3657 342.0721 367.9655 380.8131 401.5282 405.6855 410.1544 421.4044 443.0188 457.4921 458.0813 467.5948 490.1965 501.4984 503.2152 518.6852 540.0201 548.7380 568.9947 603.3872 611.3250 657.7814 676.2430 686.4114 713.4088 730.7703 735.4199 740.3575 751.5316 782.8826 815.2705 822.8504 834.5092 840.9315 875.7870 885.4727 905.2018 916.4243 925.0337 938.3674 955.2983 970.3510 976.9154 989.9631 1004.6564 1008.2726 1010.7045 1017.1414 1031.8724 1038.5441 1041.3605 1055.9361 1057.4653 1060.3461 1070.3601 1080.9277 1101.6482 1115.7712 1124.8618 1131.5127 1141.2864 1178.9209 1185.5432 1192.8204 1199.6191 1208.0186 1215.5530 1229.7553 1234.5064 1246.4808 1262.9949 1268.7241 1279.4940 1287.2863 1290.6421 1295.9593 1301.1816 1304.3490 1312.0845 1322.4592 1326.1725 1339.2103 1357.2580 1361.5278 1370.5869 1373.9331 1375.7753 1385.2080 1391.4414 1394.7967 1399.9906 1400.2835 1452.0343 1460.6343 1464.1537 1472.0245 1474.4731 1482.8450 1486.5805 1654.9790 1658.9725 2961.6029 2970.0955 2976.2866 2985.1432 2990.8985 2993.7756 3004.3012 3006.8621 3012.9257 3014.6077 3054.7065 3071.9207 3073.8320 3075.1112 3089.3383 3102.0287 3105.6936 3121.8238 3129.6588 3141.9747 3183.4737 3274.0460 3500.3266 3501.6791 3528.3439 3551.2288
redmass: 5.0151 5.2220 4.8547 6.1511 5.7081 3.3072 4.7159 4.6420 3.6561 2.1392 3.0873 5.7119 3.0211 2.9718 4.4386 4.3212 4.7709 1.1170 4.1406 4.7783 4.2417 4.9508 3.5883 3.4464 3.4912 3.6591 3.6050 4.2327 5.4944 5.8381 2.6987 2.8179 1.3601 4.6420 1.7504 3.6262 1.7441 1.5722 2.1592 3.8619 1.8011 4.6940 4.0279 3.8761 3.1202 6.5840 2.7890 4.3379 4.3620 3.9265 2.2328 1.7760 4.0385 1.5468 3.1952 3.8360 3.4466 3.4868 2.0484 3.2896 3.3074 4.4901 4.2507 1.2959 4.3261 2.1332 4.1312 2.9648 3.0273 3.4178 2.2786 2.7615 3.2318 4.6515 2.7014 1.6942 2.2476 1.7469 2.5029 2.7017 3.0146 2.4532 2.0470 2.9820 2.3756 2.5333 1.8370 1.9308 1.3917 2.0665 1.7542 1.2465 1.3633 1.4799 1.3704 1.3669 1.2516 1.3800 1.7953 1.3052 1.4361 1.2766 1.2782 1.3801 1.2556 1.3252 1.3880 1.2917 1.4649 1.5011 1.4671 1.2385 1.4031 1.4243 1.2761 1.5272 1.2325 1.2018 1.0570 1.0831 1.0602 1.0680 1.0609 1.0771 1.0750 7.1195 9.2274 1.0813 1.0849 1.0676 1.0849 1.0403 1.0818 1.0672 1.0370 1.0638 1.0814 1.0879 1.0868 1.0972 1.1025 1.0965 1.0975 1.0989 1.1012 1.1002 1.0866 1.1006 1.0714 1.0641 1.0652 1.0653 1.0657
irintensity: 2.4216 1.0683 1.3615 0.7178 1.6301 3.2166 0.9302 1.6986 1.0881 3.1039 1.0683 1.7702 3.2773 3.9236 0.5008 1.1581 9.6745 0.2930 6.1667 12.5403 5.6482 6.9997 3.8914 5.5796 9.3435 6.6937 28.3853 4.3031 2.4176 4.9854 2.2258 19.4395 54.9365 3.7341 78.6182 3.6749 36.5046 196.0258 54.4281 7.0477 115.3042 21.2866 11.2513 20.2372 4.0001 24.7768 2.5302 26.3715 7.2823 11.7762 7.7419 50.1503 79.6450 35.3298 132.9233 15.1541 68.3914 28.2099 17.5616 26.1043 42.5587 103.6883 19.3723 0.7147 180.6814 6.6048 87.9074 178.7043 107.0589 95.1442 93.6542 53.4290 78.6447 3.9159 4.4902 17.1929 86.2944 24.3274 125.6282 44.6464 102.8289 70.3779 30.3996 31.1189 51.2824 29.2618 128.5112 83.5604 44.9236 147.2628 24.8595 3.5846 73.7121 76.5242 18.6816 26.4036 5.2970 3.9225 2.8683 1.5437 34.6432 18.7091 0.5951 41.9612 0.8011 0.6211 6.7901 40.2198 21.9062 17.6206 3.8326 15.4051 5.6348 18.7846 38.0303 13.6619 27.5008 44.2401 33.9243 4.3696 10.3149 4.9259 13.6139 13.3226 7.3764 44.9396 202.9488 21.0422 15.0692 44.1869 15.1308 22.1351 31.6004 15.1125 7.8992 35.2278 11.4921 16.6275 21.1837 6.8770 33.5334 17.9708 13.4381 10.1442 9.0812 8.4628 3.2243 25.2960 600.5019 15.6291 38.4354 23.3122 23.6618
temp: 298.150 k
press: 1.00000 atm
elementType: 8 8 8 8 8 8 8 8 8 8 6 6 6 6 6 6 6 6 6 6 6 6 6 6 6 6 6 1 1 1 1 1 1 1 1 1 1 1 1 1 1 1 1 1 1 1 1 1 1 1 1 1 1
symmnumber: 1
zpe: 1116208.5 jmol-1
zpe.correction: 0.425141 hartree
zpe.thermalcorrener: 0.452394 hartree
zpe.thermalcorrenthalpy: 0.453338 hartree
zpe.thermalcorrgfe: 0.369396 hartree
zpe.sumelectzpe: -1413.475531 hartree
zpe.sumelectthermal: -1413.448278 hartree
zpe.sumelectthermalent: -1413.447334 hartree
zpe.sumelectthermalfe: -1413.531276 hartree
dipole: 3.1823 -0.4291 -1.4422
dipole: 3.5201
quadrupole: -148.5108 -164.9757 -176.4314
quadrupole: -6.6065 15.3167 3.6653
quadrupole: 14.7952 -1.6697 -13.1254 -6.6065 15.3167 3.6653
hfenergy: -1413.9006722 hartree
pointgroup: C01 [X(C17H26O10)]
dipole: -1.215465 -0.2358083 0.6204978 debye
polarizability: 235.3648589|11.4514839|205.7026016|3.525837|-7.3617199|188.0651388 unknown
InChI: InChI=1S/C17H26O10/c1-8(19)26-16(2)5-3-9-4-6-24-14(10(9)16)25-15-12(21)11(20)13(22)17(23,7-18)27-15/h4,6,9-15,18,20-23H,3,5,7H2,1-2H3
charge 0 multiplicity 1
53 atoms
O  -0.911951 1.526638 -0.22115
O  0.240877 -1.078169 0.610369
O  -1.51012 -2.510862 1.109363
O  2.147311 -1.537541 -0.819831
O  1.768848 -1.326083 2.928655
O  3.502555 0.986674 2.272203
O  1.228014 0.557878 -1.631194
O  3.307828 2.014604 -0.349989
O  2.49777 -0.441836 -3.685715
O  -1.96826 3.442118 0.6169
C  -1.804788 -0.713266 -0.672086
C  -2.115099 0.629571 0.064308
C  -3.202356 -1.328225 -1.051174
C  -3.363211 1.136456 -0.707422
C  -4.22281 -0.135379 -0.905574
C  -0.882902 -1.738876 0.00426
C  -2.330442 0.529114 1.582141
C  -3.586465 -2.506346 -0.177574
C  1.55465 -1.749349 0.479779
C  -2.801834 -2.990957 0.817772
C  2.386031 -1.128109 1.614645
C  2.571362 0.368463 1.319798
C  2.423899 -0.10425 -1.221127
C  3.203414 0.580804 -0.06258
C  -0.987835 2.913626 0.053224
C  3.295339 -0.193492 -2.496184
C  0.237178 3.633329 -0.462958
H  -1.283027 -0.425043 -1.604835
H  -3.178421 -1.653492 -2.109101
H  -3.035933 1.53704 -1.686342
H  -3.888549 1.940034 -0.169993
H  -4.867146 -0.305096 -0.024636
H  -4.883662 -0.0527 -1.785438
H  -0.541354 -2.481562 -0.747582
H  -2.628546 1.508716 1.987137
H  -3.125871 -0.203962 1.801538
H  -1.411973 0.186832 2.084172
H  -4.572599 -2.958918 -0.328142
H  1.440039 -2.842979 0.577848
H  3.368273 -1.627222 1.670871
H  -3.087572 -3.791561 1.505129
H  1.584927 0.873743 1.373049
H  4.217041 0.123641 -0.035123
H  3.999791 -1.035031 -2.399911
H  3.853781 0.761578 -2.581744
H  0.786091 -1.220628 2.810936
H  3.203017 0.746891 3.187141
H  0.586649 0.823938 -0.904636
H  3.789251 2.416615 0.420937
H  0.142126 3.770271 -1.55644
H  1.17258 3.070535 -0.29983
H  0.295672 4.625247 0.009477
H  1.664414 0.089682 -3.568539
