program: Gaussian 09
title: 000016042
version: EM64L-G09RevD.01
frameworkgroup: C1[X(C4H8Br2O2)]
method: RPBEPBE
basis: SDD
operation: Freq
keyword: #p
keyword: freq=noraman
keyword: PBEPBE/SDD
title: #p freq=noraman PBEPBE/SDD
converged: YES YES NO NO
title: Mulliken charges:
elementType: Br Br O O C C C C H H H H H H H H
charge: -0.027378 -0.027782 -0.456842 -0.456800 -0.025022 -0.024877 -0.708970 -0.708997 0.241538 0.241522 0.289028 0.326519 0.326547 0.289198 0.361172 0.361144
chargesum: 0.00000
title: Mulliken charges with hydrogens summed into heavy atoms:
elementType: Br Br O O C C C C
charge: -0.027378 -0.027782 -0.095670 -0.095656 0.216517 0.216644 -0.093422 -0.093252
polarizability: 1.35221339e+02 8.26708343e+00 6.29777385e+01 -9.20906789e+00 -2.89557701e+00 4.97444823e+01
1716.lowfreq: -5.8709 -5.0801 -0.0003 -0.0002 0.0003 5.2067 45.5677 62.8086 98.6671
frequency: 45.5676 62.8083 98.6669 106.7236 140.6835 212.9619 232.1296 370.3054 379.1708 393.6223 413.0220 444.6922 507.7585 622.9083 626.6356 825.1797 846.1628 948.7864 975.1846 994.5381 1059.2706 1094.1247 1110.0838 1152.8577 1205.1034 1212.7585 1227.4324 1258.9383 1322.0052 1337.0967 1339.9070 1389.8398 1429.0772 1429.1880 2978.7201 2994.9673 3068.9382 3069.3977 3169.4832 3169.9856 3529.5372 3531.2786
redmass: 10.2842 5.1165 3.8438 3.9220 28.7374 8.2704 4.4371 1.1391 1.7087 1.4315 3.9166 3.8131 3.1489 4.1800 5.2967 2.1922 2.0724 1.9619 1.7153 2.2515 5.5037 3.5778 1.1010 1.4051 1.1613 1.1710 1.1666 1.1823 1.3306 1.2179 1.2495 1.6078 1.1350 1.1101 1.0829 1.0861 1.0573 1.0573 1.1097 1.1097 1.0657 1.0656
irintensity: 0.5772 3.2828 5.9851 0.0000 0.0000 8.7983 0.0000 1.0669 66.0015 275.8703 0.0449 82.2441 0.0000 36.0725 0.2018 0.0001 19.0113 103.1032 0.0020 0.0001 64.1359 0.0000 67.3085 0.0014 80.8574 36.1753 0.0028 0.0014 51.6631 11.4884 0.0313 0.0001 0.6008 33.4448 0.0174 64.1685 8.6912 7.6001 0.4099 3.1720 8.5304 20.6538
temp: 298.150 k
press: 1.00000 atm
elementType: 35 35 8 8 6 6 6 6 1 1 1 1 1 1 1 1
symmnumber: 1
zpe: 312987.9 jmol-1
zpe.correction: 0.119211 hartree
zpe.thermalcorrener: 0.129400 hartree
zpe.thermalcorrenthalpy: 0.130344 hartree
zpe.thermalcorrgfe: 0.080688 hartree
zpe.sumelectzpe: -333.918928 hartree
zpe.sumelectthermal: -333.908739 hartree
zpe.sumelectthermalent: -333.907795 hartree
zpe.sumelectthermalfe: -333.957452 hartree
dipole: -0.0047 -0.0011 -0.0006
dipole: 0.0049
quadrupole: -76.5374 -67.4528 -66.5453
quadrupole: 4.0490 0.5358 -3.0254
quadrupole: -6.3589 2.7257 3.6332 4.0490 0.5358 -3.0254
hfenergy: -334.0381393 hartree
pointgroup: C01 [X(C4H8Br2O2)]
dipole: -0.0018346 -0.0005083 -0.0002208 debye
dipolederiv: -0.6492942 -0.0127582 0.0130574 -0.0948738 -0.1979443 0.0205509 0.0780715 0.0217084 -0.1494118 -0.6500907 -0.0127674 0.0134587 -0.0948306 -0.1982505 0.020659 0.0788025 0.0217479 -0.1497843 -0.399749 0.00582 -0.1254423 0.0535605 -0.7640986 -0.0435216 -0.1595195 -0.0468627 -0.514592 -0.3998355 0.0057875 -0.1259237 0.0533811 -0.7637079 -0.0434827 -0.1597612 -0.0468394 -0.5140335 0.1133482 0.0030619 0.0565002 0.0098689 0.5167707 0.1207934 0.0966365 0.0882574 0.3580995 0.1127285 0.0031549 0.0567156 0.0100687 0.5164696 0.1209964 0.097033 0.0880864 0.3574453 0.7474315 0.2240253 -0.1303097 0.1498323 0.0044439 -0.0556751 -0.1625271 -0.0175816 0.1104205 0.7485121 0.2236855 -0.1308233 0.1495748 0.0045307 -0.0560178 -0.1634811 -0.0177787 0.1107028 0.063998 -0.0040017 0.0084005 0.0078401 -0.0106957 -0.005169 -0.0111587 -0.0404668 -0.1604649 0.0641849 -0.0040481 0.0080914 0.0078354 -0.0106689 -0.0051906 -0.0115582 -0.0403911 -0.1603247 -0.057652 -0.036889 0.0840239 -0.0390524 0.089578 0.003543 0.009543 0.0298186 -0.0692984 0.0319368 -0.0468384 0.0290206 -0.0129111 -0.0066688 -0.0217452 0.0514341 -0.0194545 0.0954633 0.0320204 -0.046706 0.0291627 -0.0128487 -0.0066676 -0.0216421 0.051613 -0.019246 0.0954545 -0.0576628 -0.0367185 0.0837972 -0.0390314 0.089624 0.0034921 0.0096294 0.0297639 -0.0691523 0.1499884 -0.1324203 0.0649791 -0.074218 0.3686354 -0.0188301 0.0975266 -0.0154265 0.3299446 0.1501354 -0.1323876 0.0652916 -0.0741959 0.36865 -0.0187605 0.097716 -0.0153352 0.3295313 unknown
polarizability: 134.0772531|11.6852693|64.124292|-9.9765911|-2.6012559|49.7420145 unknown
InChI: InChI=1S/C4H8Br2O2/c5-1-3(7)4(8)2-6/h3-4,7-8H,1-2H2
charge 0 multiplicity 1
16 atoms
Br -3.593781 -0.144614 0.233552
Br 3.651732 0.094824 -0.014414
O  -0.69256 -1.671282 -0.223527
O  0.751098 1.622225 0.446307
C  -0.66862 -0.303429 0.301172
C  0.726098 0.254436 -0.079192
C  -1.76585 0.578022 -0.301899
C  1.823366 -0.627167 0.52334
H  -0.766608 -0.299428 1.407042
H  0.823307 0.250708 -1.185079
H  -1.76367 0.55038 -1.402377
H  -1.722167 1.605018 0.083173
H  1.779577 -1.654392 0.138881
H  1.823312 -0.5986 1.623726
H  -1.604459 -2.041009 -0.09212
H  1.663127 1.991407 0.313315
