program: Gaussian 09
title: 000179531
version: EM64L-G09RevD.01
frameworkgroup: C1[X(C11H13NO3)]
method: RPBEPBE
basis: SDD
operation: Freq
keyword: #p
keyword: freq=noraman
keyword: PBEPBE/SDD
title: #p freq=noraman PBEPBE/SDD
converged: YES YES NO NO
title: Mulliken charges:
elementType: O O O N C C C C C C C C C C C H H H H H H H H H H H H H
charge: -0.278234 -0.448024 -0.216692 -0.407065 0.331970 0.158481 0.471024 -0.571896 -0.374008 -0.432149 0.152299 -0.797217 -0.808971 -0.388585 0.180785 0.236272 0.239609 0.234730 0.210531 0.267082 0.230720 0.229442 0.236950 0.225136 0.364041 0.281130 0.279013 0.393624
chargesum: 0.00000
title: Mulliken charges with hydrogens summed into heavy atoms:
elementType: O O O N C C C C C C C C C C C
charge: -0.278234 -0.054400 -0.216692 -0.043024 0.331970 0.158481 0.471024 -0.335624 -0.134399 -0.197418 0.152299 -0.088883 -0.117442 0.171558 0.180785
polarizability: 1.91149065e+02 -1.07844928e+01 1.44715666e+02 8.50666130e+00 3.13851418e+00 7.68253444e+01
1716.lowfreq: -15.0549 -4.9246 -0.0006 0.0005 0.0008 7.1404 9.4473 19.2972 40.3862
frequency: -12.7598 19.0072 40.3793 55.0139 66.0848 92.6700 119.0172 154.3827 198.5265 211.2633 230.7181 276.9416 293.2204 303.8411 383.1254 431.8434 453.3411 492.3924 516.9657 537.7229 543.8747 575.4132 593.2253 600.1163 652.5187 695.4884 721.3647 761.6369 785.7041 832.6264 863.9620 895.6114 933.2237 961.8915 978.1994 986.5766 1025.2583 1043.6679 1050.3658 1054.6593 1079.1495 1136.5032 1168.5148 1182.1585 1208.7657 1245.9486 1253.2915 1293.4178 1303.7904 1330.4170 1369.1855 1395.3485 1399.2228 1406.9828 1453.3827 1456.8025 1464.5315 1467.5253 1473.6356 1474.4999 1500.1992 1562.9123 1592.2787 1620.4164 1683.5897 2976.0665 2984.9839 2991.3989 3023.5802 3057.3395 3076.5214 3086.9244 3093.6297 3116.3701 3117.1819 3141.6320 3529.0364 3561.4664
redmass: 1.0506 3.9341 8.6849 5.1158 5.7839 3.2025 1.0965 3.3351 2.9176 4.1956 5.6093 4.1154 3.9663 4.9009 5.2383 2.8837 3.4774 1.8973 4.3581 4.4348 4.0906 3.8749 1.3020 3.0736 1.4413 4.5244 5.5516 3.4945 5.7576 1.4613 4.6274 1.2915 3.4149 1.3698 2.0347 1.4902 1.4986 1.6464 1.6137 3.9787 2.1543 2.3942 2.0726 1.7086 1.0836 2.1305 1.9988 1.5575 2.4363 1.6863 6.6447 1.8042 1.4752 1.3036 1.0987 1.2052 1.4496 1.2331 1.0925 1.1813 2.5332 6.4762 6.9750 6.2729 9.1797 1.0387 1.0620 1.0367 1.0969 1.0950 1.0966 1.0997 1.1003 1.0911 1.0869 1.0968 1.0644 1.0782
irintensity: 0.5183 0.0868 3.1475 1.8012 5.0665 0.8079 0.7030 1.1693 1.8839 7.3579 2.6536 2.7510 7.2757 3.2515 0.9726 3.5957 9.7091 41.2121 14.7528 0.2142 44.1378 9.3910 44.2895 6.4327 184.7810 18.5234 2.9361 8.8591 3.0694 26.0309 43.9465 2.2877 9.8072 0.4492 0.8585 0.6802 1.1740 4.1084 20.7602 23.9563 208.9315 2.5102 5.0135 5.3324 0.2159 1.1429 51.2871 1.4071 55.8312 26.6479 1.3239 17.1258 3.9752 22.2717 9.7410 44.9756 174.9984 125.7793 57.2825 107.1691 56.1980 75.0071 87.4278 66.8822 281.9058 32.5588 29.6433 23.0229 5.3558 21.4414 17.5510 16.8148 16.8329 26.6701 10.9541 17.8169 31.2781 54.4844
temp: 298.150 k
press: 1.00000 atm
elementType: 8 8 8 7 6 6 6 6 6 6 6 6 6 6 6 1 1 1 1 1 1 1 1 1 1 1 1 1
symmnumber: 1
zpe: 578456.9 jmol-1
zpe.correction: 0.220323 hartree
zpe.thermalcorrener: 0.234982 hartree
zpe.thermalcorrenthalpy: 0.235926 hartree
zpe.thermalcorrgfe: 0.176527 hartree
zpe.sumelectzpe: -706.316191 hartree
zpe.sumelectthermal: -706.301532 hartree
zpe.sumelectthermalent: -706.300588 hartree
zpe.sumelectthermalfe: -706.359987 hartree
dipole: 1.8988 -3.9140 1.6992
dipole: 4.6703
quadrupole: -87.8110 -84.2637 -89.4412
quadrupole: 6.7961 -1.5315 2.9047
quadrupole: -0.6390 2.9083 -2.2692 6.7961 -1.5315 2.9047
hfenergy: -706.5365136 hartree
pointgroup: C01 [X(C11H13N1O3)]
dipole: -1.0161178 -0.0706167 1.5292952 debye
polarizability: 192.0236491|13.5418046|94.6226401|-6.9697358|28.3044428|126.0437856 unknown
InChI: InChI=1S/C11H13NO3/c1-7-3-4-9(8(2)5-7)11(15)12-6-10(13)14/h3-5,12-13H,6H2,1-2H3
charge 0 multiplicity 1
28 atoms
O  1.249429 -0.139142 -1.857372
O  3.114714 0.657274 2.540623
O  5.139742 0.867557 1.415613
N  1.671047 0.237399 0.383359
C  -1.539238 -0.982686 -0.999708
C  -0.655109 -0.099772 -0.303149
C  -3.425593 -0.171962 0.409722
C  -2.902561 -0.998698 -0.616794
C  -1.172609 0.739671 0.71907
C  -2.536379 0.710126 1.071502
C  0.801877 -0.010768 -0.671087
C  -1.069043 -1.896959 -2.116592
C  -4.892401 -0.243692 0.794332
C  3.099864 0.398617 0.127957
C  3.910184 0.666479 1.381555
H  -3.581895 -1.681443 -1.143359
H  -0.510098 1.45841 1.216282
H  -2.913446 1.379512 1.853531
H  -1.878185 -2.581273 -2.424975
H  -0.736349 -1.311281 -2.990419
H  -0.194997 -2.500538 -1.812428
H  -5.536063 -0.401076 -0.089343
H  -5.07899 -1.08663 1.488042
H  -5.224252 0.679452 1.300331
H  1.353189 0.236026 1.353805
H  3.283498 1.226091 -0.584835
H  3.522229 -0.500047 -0.365725
H  3.682135 0.827153 3.339663
