program: Gaussian 09
title: 000179524
version: EM64L-G09RevD.01
frameworkgroup: C1[X(C8H15NO3)]
method: RPBEPBE
basis: SDD
operation: Freq
keyword: #p
keyword: freq=noraman
keyword: PBEPBE/SDD
title: #p freq=noraman PBEPBE/SDD
converged: YES YES NO NO
title: Mulliken charges:
elementType: O O O N C C C C C C C C H H H H H H H H H H H H H H H
charge: -0.459021 -0.449666 -0.455428 -0.088018 -0.185114 -0.117731 -0.118860 -0.108792 -0.418298 -0.429091 -0.483917 -0.428449 0.235013 0.263291 0.208257 0.201400 0.231528 0.195921 0.225982 0.226208 0.225924 0.224574 0.245223 0.215681 0.345436 0.349410 0.348537
chargesum: 0.00000
title: Mulliken charges with hydrogens summed into heavy atoms:
elementType: O O O N C C C C C C C C
charge: -0.113585 -0.100257 -0.106891 -0.088018 0.049899 0.145560 0.089397 0.092608 0.009151 0.023099 -0.033420 0.032456
polarizability: 1.10100890e+02 -3.30827501e-02 1.00370312e+02 5.72954814e-01 3.51473614e-02 8.16595426e+01
1716.lowfreq: -11.0605 -8.8189 -0.0005 0.0002 0.0003 14.2100 44.9771 100.6721 104.2793
frequency: 44.8056 100.6426 104.2577 149.6581 180.0925 190.7136 269.1672 273.8875 313.7041 333.9743 336.6235 363.2765 403.9877 476.2746 512.3312 533.7422 549.7782 580.7399 608.0448 656.8184 820.2567 836.5988 846.4230 889.6076 920.8792 938.1231 964.1658 985.6027 1023.9580 1024.5526 1033.7266 1048.4092 1066.8783 1087.8071 1103.7415 1114.0356 1119.7839 1137.0382 1160.8885 1190.5219 1213.0027 1223.1125 1236.9861 1258.9634 1265.2843 1269.8473 1302.7562 1305.4278 1316.4027 1325.0660 1328.2722 1349.3865 1361.8941 1373.9529 1382.8356 1409.7304 1461.7727 1471.1128 1484.5571 1494.0987 2912.0671 2940.8224 2955.6542 2973.8108 2979.3483 2997.5052 3001.7280 3007.1517 3047.0785 3060.1531 3071.0925 3077.9712 3449.6648 3570.4343 3571.7014
redmass: 4.2541 3.5614 3.9400 2.7449 4.6128 3.2221 1.2272 1.4165 1.4817 5.5839 3.4572 3.0291 2.6442 6.3764 4.4679 3.3305 2.7792 2.3625 1.1635 3.5816 2.0460 2.3234 4.2410 2.3598 4.1257 2.2275 1.5110 2.3184 2.3525 3.7490 3.4154 2.8278 1.6123 2.0705 3.6230 2.0788 1.5227 1.6232 1.5751 1.4757 1.4483 1.6208 1.2607 1.1676 1.1537 1.3072 1.1963 1.1902 1.3092 1.3586 1.3660 1.4450 1.2316 1.3918 1.4852 1.6403 1.0996 1.0856 1.0838 1.0852 1.0706 1.0823 1.0843 1.0719 1.0822 1.0608 1.0755 1.0663 1.0938 1.0977 1.1052 1.1076 1.0653 1.0662 1.0663
irintensity: 0.8553 1.3314 7.7447 1.9352 11.3536 8.2487 147.5936 30.7225 131.9963 4.5527 12.0929 19.9466 12.4129 15.5833 0.6278 4.5156 7.6518 2.3203 133.3384 16.7291 18.9072 1.2419 12.3415 18.1042 68.4049 11.4875 5.0056 6.9131 41.2780 26.9935 71.8037 35.8600 1.5671 17.9030 23.3165 8.0387 0.2530 30.2608 30.0255 36.2247 18.3620 11.0976 18.4890 11.5653 5.2618 3.3538 11.1364 1.7989 5.2984 7.8434 12.4533 22.8897 28.4748 1.0390 0.6544 19.0705 11.3397 7.5968 3.3951 9.7593 40.9870 60.5584 23.2044 58.8730 74.6925 16.6878 13.2341 76.2279 52.4965 24.3702 58.7706 27.3287 64.5639 11.6597 4.1789
temp: 298.150 k
press: 1.00000 atm
elementType: 8 8 8 7 6 6 6 6 6 6 6 6 1 1 1 1 1 1 1 1 1 1 1 1 1 1 1
symmnumber: 1
zpe: 602595.9 jmol-1
zpe.correction: 0.229517 hartree
zpe.thermalcorrener: 0.241453 hartree
zpe.thermalcorrenthalpy: 0.242397 hartree
zpe.thermalcorrgfe: 0.191867 hartree
zpe.sumelectzpe: -593.257527 hartree
zpe.sumelectthermal: -593.245591 hartree
zpe.sumelectthermalent: -593.244647 hartree
zpe.sumelectthermalfe: -593.295176 hartree
dipole: 3.4151 3.2127 -0.7458
dipole: 4.7477
quadrupole: -71.4900 -72.6694 -72.4065
quadrupole: -0.3086 -1.5574 -3.0934
quadrupole: 0.6986 -0.4808 -0.2179 -0.3086 -1.5574 -3.0934
hfenergy: -593.4870435 hartree
pointgroup: C01 [X(C8H15N1O3)]
dipole: -1.4248993 1.1998885 0.1375235 debye
polarizability: 109.8352796|0.6490429|100.3676897|2.6168101|-0.7705742|81.9277753 unknown
InChI: InChI=1S/C8H15NO3/c10-4-5-7(12)3-9-2-1-6(11)8(5)9/h5-8,10-12H,1-4H2
charge 0 multiplicity 1
27 atoms
O  -1.170432 2.309813 0.331151
O  2.261886 -1.37689 1.047427
O  3.054055 1.320032 0.27441
N  -0.96134 -1.196151 -0.709636
C  -0.513879 0.245913 -0.854018
C  0.787328 0.361016 -0.021441
C  -1.706477 1.117049 -0.345705
C  1.32064 -1.095096 -0.0322
C  0.038758 -1.928393 0.129506
C  -2.363378 -1.190724 -0.195331
C  -2.516958 0.158113 0.558858
C  1.806805 1.377257 -0.541498
H  -0.307945 0.478035 -1.91781
H  0.530762 0.616674 1.0259
H  -2.329281 1.430974 -1.210628
H  1.788687 -1.304706 -1.020236
H  0.16269 -2.968991 -0.216268
H  -0.228967 -1.946902 1.211914
H  -2.540852 -2.068224 0.450349
H  -3.080588 -1.244486 -1.038467
H  -3.568678 0.468674 0.694419
H  -2.032068 0.102603 1.551985
H  1.389092 2.401353 -0.537196
H  2.138847 1.121602 -1.563377
H  -1.924109 2.896901 0.589566
H  2.971833 -0.680739 0.96621
H  2.897073 1.816691 1.116817
