program: Gaussian 09
title: 000179519
version: EM64L-G09RevD.01
frameworkgroup: C1[X(C15H24O)]
method: RPBEPBE
basis: SDD
operation: Freq
keyword: #pfreq=noraman
keyword: PBEPBE/SDD
title: #p freq=noraman PBEPBE/SDD
converged: NO YES NO NO
title: Mulliken charges:
elementType: O C C C C C C C C C C C C C C C H H H H H H H H H H H H H H H H H H H H H H H H
charge: -0.455983 0.420608 -0.226469 -0.249609 -0.410994 -0.007798 -0.536242 -0.496546 -0.485093 0.571540 -0.816669 -0.071081 -0.471730 -0.552639 -0.733465 -0.737107 0.232684 0.231941 0.242595 0.183148 0.213029 0.198032 0.213023 0.204451 0.210599 0.214605 0.200996 0.239549 0.225388 0.207825 0.216836 0.193723 0.205587 0.206642 0.209747 0.220453 0.205013 0.207496 0.234037 0.341878
chargesum: 0.00000
title: Mulliken charges with hydrogens summed into heavy atoms:
elementType: O C C C C C C C C C C C C C C C
charge: -0.114104 0.420608 0.006214 -0.017668 -0.168399 0.175350 -0.125182 -0.079071 -0.059889 0.571540 -0.150735 0.136744 -0.254894 -0.153329 -0.096624 -0.090561
polarizability: 1.68093466e+02 -2.22823862e-01 1.48291448e+02 4.49303169e+00 1.46849807e+00 1.51679422e+02
1716.lowfreq: -11.5022 -0.0007 -0.0007 -0.0006 14.5411 27.1890 49.7341 53.2048 84.5989
frequency: 49.6931 53.1975 84.5831 98.6838 136.9254 178.8371 193.7496 199.8955 220.0394 232.4277 243.4287 250.9410 271.0522 291.1964 302.1593 317.4054 356.0336 390.6513 398.9803 417.9052 436.3444 444.7565 496.0999 542.4208 588.4655 600.9621 641.4092 691.0753 794.5010 805.8166 823.0678 844.8992 860.3248 886.8886 896.5596 909.0477 914.3005 920.5883 925.0744 942.1486 954.3065 966.0227 969.8115 985.3210 1011.1633 1026.8167 1038.8919 1055.6002 1066.9247 1096.7566 1111.0433 1121.0491 1132.3155 1147.4144 1162.4766 1171.5495 1179.4444 1185.8212 1195.4135 1203.1136 1212.6188 1223.6405 1232.0603 1241.9081 1262.1005 1270.6258 1282.6404 1295.9286 1311.6950 1320.9405 1327.9600 1334.0756 1337.2727 1354.4638 1360.9416 1377.0024 1386.9916 1393.3670 1393.4937 1455.7608 1462.5208 1463.6699 1467.3167 1470.2569 1474.4349 1481.0528 1483.9885 1485.9516 1492.9148 1677.3038 2919.9738 2921.1430 2947.7967 2949.5617 2958.0288 2967.0933 2970.5082 2971.1192 2975.1092 2984.6239 2988.5332 3000.8642 3014.1670 3031.9820 3043.3340 3050.9608 3054.1817 3054.9349 3062.9749 3074.1987 3079.4231 3087.7395 3106.9293 3550.5770
redmass: 2.8610 3.7251 3.4667 3.4848 3.0710 1.2280 1.6591 1.2238 1.6325 1.1501 1.4990 2.5596 3.0087 2.7395 2.4326 2.1888 2.4524 2.3110 2.5701 2.6122 3.3998 2.5810 3.5557 3.7725 2.7850 3.9651 2.8984 3.8550 1.5802 1.8796 2.6457 1.9973 2.7115 2.4217 2.4809 1.9643 1.2340 2.3054 2.5100 3.9934 1.4669 2.3600 1.5677 1.7802 1.8639 2.6139 1.6934 1.4443 1.6224 1.8020 1.5359 1.5384 1.5424 1.6815 1.8769 1.7078 1.7445 1.1910 1.4815 1.6155 2.1931 1.6164 1.6945 1.4921 1.4781 1.3744 1.4464 1.3326 1.5350 1.4669 1.3508 1.5845 1.6117 2.2015 1.6023 1.2106 1.2243 1.2071 1.4506 1.0848 1.0615 1.0944 1.0518 1.0547 1.0688 1.0628 1.0548 1.0623 1.0575 6.9927 1.0592 1.0801 1.0847 1.0602 1.0594 1.0365 1.0390 1.0369 1.0663 1.1023 1.0994 1.0872 1.0967 1.0874 1.0991 1.0902 1.0975 1.0989 1.0982 1.0980 1.0981 1.0965 1.0926 1.0665
irintensity: 0.2906 0.4309 4.1637 2.4311 0.6255 0.3376 9.6564 2.8284 7.9775 123.4949 1.4350 1.3259 1.1750 2.1564 0.3989 0.4411 0.6743 0.7636 1.5046 0.2451 0.5413 0.4196 7.8326 0.4006 1.3009 0.9954 0.3601 4.9636 22.1279 9.7225 4.5677 13.6120 3.2622 0.4164 12.8487 8.9612 0.9685 5.6411 20.9600 25.4333 0.9405 0.4806 6.2900 3.2514 0.8705 2.5590 4.1200 3.2953 4.3725 0.7754 5.2061 8.0180 19.0430 11.7696 17.3480 8.9016 0.7181 4.9722 6.0626 0.4740 0.3406 3.0591 13.7822 1.5492 3.6887 5.1857 1.1750 1.9413 2.9399 0.4717 1.8526 1.1021 4.2112 4.7769 3.6385 16.7636 19.0699 23.3328 7.4865 17.1234 5.1056 4.8727 1.8627 5.3799 9.9545 5.6294 5.6094 9.4397 10.3212 4.8051 66.6243 10.7088 38.4046 46.5269 38.6757 30.0960 69.4885 31.2300 26.1057 56.2082 29.1002 63.7248 45.9589 36.5264 52.7660 20.0020 31.4964 10.2124 100.9482 42.1247 45.4335 28.4573 30.1658 3.1482
temp: 298.150 k
press: 1.00000 atm
elementType: 8 6 6 6 6 6 6 6 6 6 6 6 6 6 6 6 1 1 1 1 1 1 1 1 1 1 1 1 1 1 1 1 1 1 1 1 1 1 1 1
symmnumber: 1
zpe: 930302.6 jmol-1
zpe.correction: 0.354334 hartree
zpe.thermalcorrener: 0.370804 hartree
zpe.thermalcorrenthalpy: 0.371748 hartree
zpe.thermalcorrgfe: 0.311716 hartree
zpe.sumelectzpe: -659.905012 hartree
zpe.sumelectthermal: -659.888542 hartree
zpe.sumelectthermalent: -659.887597 hartree
zpe.sumelectthermalfe: -659.947630 hartree
dipole: -0.4063 -1.5225 0.1987
dipole: 1.5882
quadrupole: -101.2044 -92.6464 -96.4395
quadrupole: -6.3382 0.9480 4.8758
quadrupole: -4.4410 4.1170 0.3239 -6.3382 0.9480 4.8758
hfenergy: -660.2593459 hartree
pointgroup: C01 [X(C15H24O1)]
dipole: -0.1331109 -0.6061362 0.0729771 debye
polarizability: 168.3492692|0.5623188|148.254815|3.8995151|1.5782178|151.4602512 unknown
InChI: InChI=1S/C15H24O/c1-9(2)11-6-7-15(3)12-5-4-10(8-16)14(15)13(11)12/h4,9,11-14,16H,5-8H2,1-3H3
charge 0 multiplicity 1
40 atoms
O  2.961283 -1.31446 -2.033168
C  0.73205 1.372932 -0.201291
C  -0.482733 -0.184168 0.68174
C  0.335555 1.014597 1.29183
C  0.619283 -0.196791 -0.45995
C  -1.892122 0.246465 0.198567
C  -0.464368 2.111041 -0.865715
C  -1.717698 1.21147 -1.009815
C  1.538438 0.485783 2.10992
C  1.850307 -0.915388 0.074477
C  2.046726 2.102153 -0.489641
C  -2.815043 -0.966998 -0.143513
C  2.278462 -0.58877 1.325502
C  2.512547 -1.965316 -0.775612
C  -3.134069 -1.824842 1.106904
C  -4.145185 -0.517673 -0.798884
H  -0.51441 -1.094485 1.304704
H  -0.23463 1.781973 1.849596
H  0.348508 -0.531309 -1.474607
H  -2.378092 0.800411 1.034431
H  -0.162624 2.478467 -1.866874
H  -0.698157 3.009984 -0.257851
H  -2.620918 1.831643 -1.15737
H  -1.60861 0.597503 -1.926561
H  1.186354 0.08012 3.082015
H  2.234765 1.314688 2.359414
H  1.986824 3.157401 -0.157429
H  2.907917 1.628404 0.009947
H  2.256899 2.099503 -1.575778
H  -2.268987 -1.603974 -0.874349
H  3.159605 -1.067296 1.774248
H  1.785011 -2.773374 -1.016325
H  3.375112 -2.411893 -0.237821
H  -3.680952 -1.222519 1.858773
H  -3.773352 -2.686532 0.838226
H  -2.225187 -2.223751 1.590897
H  -4.6948 0.17311 -0.129354
H  -4.798317 -1.389605 -0.990795
H  -3.983647 -0.001895 -1.761123
H  3.208458 -2.016808 -2.687466
