program: Gaussian 09
title: 000179451
version: EM64L-G09RevD.01
frameworkgroup: C1[X(C9H18O6)]
method: RPBEPBE
basis: SDD
operation: Freq
keyword: #pfreq=noraman
keyword: PBEPBE/SDD
title: #p freq=noraman PBEPBE/SDD
converged: NO YES NO NO
title: Mulliken charges:
elementType: O O O O O O C C C C C C C C C H H H H H H H H H H H H H H H H H H
charge: -0.287285 -0.319772 -0.464689 -0.462993 -0.446607 -0.438702 -0.152985 -0.093517 -0.211608 -0.033655 -0.059172 -0.368997 0.072779 -0.673019 -0.689660 0.243897 0.219746 0.269991 0.251088 0.229969 0.190065 0.252457 0.211953 0.366084 0.366495 0.355703 0.219489 0.220857 0.221052 0.237692 0.217719 0.209323 0.346302
chargesum: 0.00000
title: Mulliken charges with hydrogens summed into heavy atoms:
elementType: O O O O O O C C C C C C C C C
charge: -0.287285 -0.319772 -0.098605 -0.096498 -0.090904 -0.092400 0.090913 0.126228 0.058383 0.217434 0.170797 0.073525 0.284732 -0.011621 -0.024927
polarizability: 1.33521183e+02 -4.04063287e-01 1.20246301e+02 1.67865977e+00 2.29152943e+00 9.77803471e+01
1716.lowfreq: -16.0437 -9.9212 -8.7211 -0.0012 -0.0011 -0.0007 17.6183 44.2241 49.9746
frequency: 10.2012 44.0426 49.7821 91.1759 111.7504 116.2860 149.5898 175.4741 178.7653 202.7281 218.6619 232.9300 236.3967 286.1561 315.2703 360.0133 372.6950 386.5258 402.9275 415.7142 426.8529 430.1475 441.3813 457.1876 509.7344 538.4554 550.1006 566.8956 614.1554 697.1638 789.0451 824.0758 869.9315 918.8070 927.1417 934.5727 940.0037 959.4072 966.8323 991.1452 1008.3059 1027.6490 1048.4379 1056.5863 1065.8257 1107.4897 1112.5204 1127.4714 1151.6653 1177.7420 1183.0717 1193.0656 1220.1553 1231.6389 1261.6151 1279.8693 1288.3152 1297.9813 1308.0511 1314.2326 1330.6973 1336.1434 1343.2856 1359.6023 1378.3275 1380.5495 1384.1057 1388.9510 1397.2581 1400.8321 1458.1911 1462.1324 1462.5784 1471.6342 1483.0818 2956.8782 2963.9835 2978.3241 2984.5634 2992.0918 2992.4685 3025.3843 3031.6527 3070.4871 3080.1353 3085.6928 3093.4005 3100.8680 3110.0274 3485.4140 3543.9089 3545.7263 3548.3134
redmass: 2.5655 4.2252 5.5273 4.8697 5.3786 4.6849 3.8478 1.1634 2.5924 2.9522 1.4290 2.9702 4.6598 3.3491 3.6831 2.9294 5.9278 3.0300 2.8898 3.4372 1.3298 1.2101 1.3458 2.1917 3.6683 1.4458 2.7240 3.4866 3.8567 4.2612 2.8706 3.3561 2.9787 1.4849 2.4007 4.8716 1.4360 5.6864 3.5726 2.8319 5.0920 3.0956 2.6522 3.0771 3.1999 1.8306 2.0072 2.8244 2.0772 1.7753 1.3799 1.3089 1.2617 1.2301 1.4145 1.2341 1.2456 1.2412 1.2073 1.2348 1.3127 1.2027 1.4430 1.3865 1.2490 1.2675 1.2659 1.4637 1.2279 1.7992 1.0497 1.0733 1.0547 1.0499 1.0494 1.0808 1.0710 1.0846 1.0357 1.0360 1.0859 1.0846 1.0862 1.0866 1.0989 1.1005 1.0992 1.1003 1.0942 1.0646 1.0653 1.0656 1.0655
irintensity: 0.3360 1.3233 1.1580 3.8883 1.6747 0.1717 0.9547 0.3955 1.6824 0.8673 4.0955 7.6565 17.2458 1.9967 22.2803 4.6730 2.4693 15.2692 6.1234 8.7202 114.6517 39.9601 255.6499 33.8349 24.1123 143.3105 34.4743 24.9313 19.5218 6.2489 18.5724 37.7381 30.7998 23.9613 6.2193 225.1251 3.4963 137.6292 143.6687 72.4509 1.9710 22.1766 109.4932 103.0179 15.7931 58.7044 2.6916 21.5016 11.0737 29.5159 6.6000 25.3628 10.2771 67.7614 5.6966 8.1715 42.0306 32.7986 6.6546 8.0606 3.1585 11.7458 2.4990 0.5899 39.4815 14.6352 34.0366 2.2158 24.9560 11.7692 6.7328 5.0861 1.1253 9.5873 15.6876 6.9782 54.8817 42.0484 17.6042 16.2439 15.4348 35.2314 31.3394 22.8953 25.8322 9.3609 54.7406 30.7870 10.0228 28.2796 8.9035 14.5004 21.6683
temp: 298.150 k
press: 1.00000 atm
elementType: 8 8 8 8 8 8 6 6 6 6 6 6 6 6 6 1 1 1 1 1 1 1 1 1 1 1 1 1 1 1 1 1 1
symmnumber: 1
zpe: 716554.2 jmol-1
zpe.correction: 0.272921 hartree
zpe.thermalcorrener: 0.290107 hartree
zpe.thermalcorrenthalpy: 0.291051 hartree
zpe.thermalcorrgfe: 0.227173 hartree
zpe.sumelectzpe: -803.826729 hartree
zpe.sumelectthermal: -803.809543 hartree
zpe.sumelectthermalent: -803.808599 hartree
zpe.sumelectthermalfe: -803.872477 hartree
dipole: -3.3923 -1.8281 -0.4470
dipole: 3.8794
quadrupole: -83.8979 -105.7079 -89.5323
quadrupole: -5.0120 -2.0283 -5.1715
quadrupole: 9.1481 -12.6619 3.5137 -5.0120 -2.0283 -5.1715
hfenergy: -804.09965 hartree
pointgroup: C01 [X(C9H18O6)]
dipole: 1.3182269 0.7602222 -0.1177065 debye
polarizability: 133.4724043|0.0351267|120.4734706|-2.1966397|0.0519901|97.6019558 unknown
InChI: InChI=1S/C9H18O6/c1-4(2)14-9-8(13)7(12)6(11)5(3-10)15-9/h4-13H,3H2,1-2H3
charge 0 multiplicity 1
33 atoms
O  -0.089063 -0.754002 -1.119516
O  1.457105 0.416698 0.347051
O  -2.427798 2.285157 0.628868
O  -3.023226 -0.46981 1.18104
O  0.357225 2.868418 -0.163382
O  -0.603258 -3.491988 -0.727439
C  -1.389369 1.256736 0.4994
C  -2.105472 -0.04536 0.122016
C  -0.358554 1.653712 -0.574856
C  -1.064901 -1.162451 -0.057802
C  0.620796 0.490263 -0.843715
C  -1.652844 -2.484779 -0.551554
C  2.692078 -0.423568 0.207104
C  3.801889 0.383205 -0.487391
C  3.058479 -0.859145 1.628505
H  -0.865646 1.113903 1.469218
H  -2.657053 0.119239 -0.830021
H  -0.882232 1.921309 -1.508056
H  -0.512218 -1.318326 0.888534
H  1.224165 0.660708 -1.754385
H  -2.207318 -2.313844 -1.49907
H  -2.344428 -2.884789 0.204874
H  2.417644 -1.308576 -0.401729
H  -1.973235 3.159026 0.747729
H  -3.570005 0.321252 1.426788
H  1.069254 2.564544 0.463816
H  4.699308 -0.247046 -0.626722
H  3.48723 0.742359 -1.483725
H  4.084393 1.258819 0.124063
H  2.238141 -1.440305 2.082499
H  3.255555 0.023284 2.263371
H  3.967284 -1.487224 1.6149
H  0.079273 -3.091818 -1.326412
