program: Gaussian 09
title: 000179437
version: EM64L-G09RevD.01
frameworkgroup: C1[X(C18H12O2)]
method: RPBEPBE
basis: SDD
operation: Freq
keyword: #pfreq=noraman
keyword: PBEPBE/SDD
title: #p freq=noraman PBEPBE/SDD
converged: YES YES NO NO
title: Mulliken charges:
elementType: O O C C C C C C C C C C C C C C C C C C H H H H H H H H H H H H
charge: -0.416516 -0.217051 -0.515919 0.283444 0.270912 0.252739 0.397821 0.243142 0.368375 -0.443108 -0.428179 -0.409122 -0.418253 -0.435046 -0.433751 -0.661886 -0.231056 -0.238499 -0.239462 0.210813 0.250231 0.250558 0.234042 0.265697 0.251806 0.250964 0.248375 0.252300 0.222156 0.227445 0.227390 0.379641
chargesum: 0.00000
title: Mulliken charges with hydrogens summed into heavy atoms:
elementType: O O C C C C C C C C C C C C C C C C C C
charge: -0.036875 -0.217051 -0.515919 0.283444 0.270912 0.252739 0.397821 0.243142 0.368375 -0.192877 -0.177621 -0.175081 -0.152556 -0.183240 -0.182788 -0.161211 -0.008901 -0.011054 -0.012072 0.210813
polarizability: 3.19255930e+02 7.85874674e+00 2.29463998e+02 -1.82981103e+01 3.48478169e+00 9.32051047e+01
1716.lowfreq: -6.3617 -1.8421 0.0005 0.0007 0.0008 5.7494 21.7569 43.8757 59.6379
frequency: 21.7040 43.8747 59.6117 105.8179 122.0523 161.2675 175.3904 194.1991 247.1125 280.3635 335.1880 357.4815 400.5883 434.0113 438.5292 461.7655 465.3428 506.4034 527.6549 548.8152 553.8664 570.7834 579.0231 618.6551 644.7104 656.5662 667.6873 689.2461 749.4374 755.4922 770.0422 787.7522 794.3724 823.3122 838.5267 847.8355 869.7325 888.9214 911.0609 923.8911 939.5984 952.3395 961.7627 983.3034 985.2073 1007.1745 1020.2315 1041.4106 1059.0712 1082.5419 1101.8533 1152.2950 1162.5507 1174.1918 1183.1725 1206.4438 1232.3663 1246.8154 1273.6675 1289.4102 1294.4696 1310.9725 1344.6962 1385.1891 1399.4928 1410.6194 1438.1055 1442.9038 1461.7833 1467.5455 1476.5239 1496.3575 1581.5972 1611.1791 1615.1224 1617.8812 1622.9975 1668.5245 3033.6896 3099.9271 3123.3915 3127.3145 3127.6373 3131.7546 3143.3718 3145.2382 3149.2916 3162.4469 3163.8761 3508.6945
redmass: 8.0306 7.6068 6.5412 6.3643 4.0564 4.2925 4.6518 4.5493 4.6103 4.4255 5.1815 5.1042 2.7624 3.3982 4.0985 3.2022 4.3110 3.6454 5.0217 4.5354 5.9289 3.4164 4.9947 2.0082 3.1104 4.6869 3.0776 4.3347 3.3207 1.6164 2.0109 4.2776 2.1805 3.0717 5.1458 2.7326 2.0737 1.5839 2.9289 1.4712 3.1520 1.4431 1.4852 1.3672 1.3390 4.2384 2.1956 2.0795 2.3565 2.5345 1.9156 1.8226 1.5166 1.1596 1.2194 1.5518 2.2755 1.6300 1.6473 1.9949 1.6523 1.9639 2.8588 3.0391 4.0838 2.4589 3.0005 3.0259 1.1128 4.2685 4.1529 4.4949 6.4193 7.9215 7.3037 7.5251 7.3353 8.6190 1.0586 1.1040 1.0853 1.0873 1.0875 1.0897 1.0944 1.0926 1.0957 1.1001 1.0972 1.0639
irintensity: 1.5159 0.5121 0.5125 0.8665 0.4495 4.5149 0.5337 0.5065 0.5288 0.6623 0.1977 0.0965 5.3068 1.0040 1.6574 1.1011 0.8166 30.6511 2.5075 21.8495 2.7512 4.1447 8.3222 87.8225 5.3533 12.0762 35.4265 41.2439 9.5949 16.0227 67.3714 19.1929 55.7935 3.5749 5.0268 29.7562 10.6576 1.1174 8.8508 0.2059 7.8089 3.2552 0.5284 0.9877 0.0706 9.0607 13.6808 120.6784 59.1406 2.5228 13.1898 19.7732 6.0217 0.3671 19.7085 4.4902 0.1007 9.2474 4.5508 2.8757 0.1884 61.1412 1.7336 5.7289 8.5384 16.8854 12.2247 3.3052 21.6528 30.6536 35.1902 17.8185 0.0822 1.2330 1.1709 0.8755 0.2040 250.3316 16.8228 3.3922 2.0530 21.0012 1.5377 0.4822 10.9414 25.9424 22.2994 48.2003 13.9911 22.0068
temp: 298.150 k
press: 1.00000 atm
elementType: 8 8 6 6 6 6 6 6 6 6 6 6 6 6 6 6 6 6 6 6 1 1 1 1 1 1 1 1 1 1 1 1
symmnumber: 1
zpe: 642670.3 jmol-1
zpe.correction: 0.244780 hartree
zpe.thermalcorrener: 0.259731 hartree
zpe.thermalcorrenthalpy: 0.260675 hartree
zpe.thermalcorrgfe: 0.201477 hartree
zpe.sumelectzpe: -842.257075 hartree
zpe.sumelectthermal: -842.242125 hartree
zpe.sumelectthermalent: -842.241180 hartree
zpe.sumelectthermalfe: -842.300379 hartree
dipole: -0.0968 1.3311 -0.7329
dipole: 1.5226
quadrupole: -102.2364 -102.1639 -119.5991
quadrupole: 7.2975 -4.8607 6.3616
quadrupole: 5.7634 5.8359 -11.5993 7.2975 -4.8607 6.3616
hfenergy: -842.5018556 hartree
pointgroup: C01 [X(C18H12O2)]
dipole: -0.0392008 -0.531381 0.2737335 debye
polarizability: 319.2190615|-8.553463|229.2024282|18.0951871|7.2126822|93.5035426 unknown
InChI: InChI=1S/C18H12O2/c19-17(20)10-11-8-9-16-14-5-2-1-4-13(14)15-7-3-6-12(11)18(15)16/h1-9,19H,10H2
charge 0 multiplicity 1
32 atoms
O  4.681255 -0.871435 -0.712607
O  4.624286 1.392327 -1.233246
C  -0.155221 -0.211887 0.233864
C  -0.766722 1.083968 0.232045
C  -1.13075 -1.240625 0.022608
C  -2.215935 0.865712 0.006577
C  1.230966 -0.449555 0.420479
C  -2.438604 -0.555149 -0.121218
C  2.060457 0.717857 0.631875
C  0.053481 2.198854 0.426232
C  -0.701097 -2.570904 -0.005739
C  1.459673 1.991397 0.62537
C  1.647406 -1.827189 0.378713
C  -3.29308 1.765871 -0.089947
C  -3.734762 -1.054805 -0.344006
C  3.565894 0.592201 0.861499
C  0.698426 -2.842698 0.1732
C  -4.5966 1.253609 -0.314369
C  -4.814926 -0.140508 -0.440113
C  4.330681 0.464164 -0.452247
H  -0.344119 3.219421 0.434965
H  -1.397275 -3.402364 -0.16197
H  2.098799 2.868993 0.777693
H  2.705037 -2.088224 0.485029
H  -3.136085 2.846002 0.004914
H  -3.91531 -2.13092 -0.442883
H  3.798854 -0.278195 1.495995
H  3.939181 1.501641 1.360821
H  1.0363 -3.88496 0.144245
H  -5.445065 1.942449 -0.391951
H  -5.829902 -0.514959 -0.613476
H  5.143061 -0.926088 -1.593454
