program: Gaussian 09
title: 000179436
version: EM64L-G09RevD.01
frameworkgroup: C1[X(C8H14N4OS)]
method: RPBEPBE
basis: SDD
operation: Freq
keyword: #p
keyword: freq=noraman
keyword: PBEPBE/SDD
title: #p freq=noraman PBEPBE/SDD
converged: YES YES NO NO
title: Mulliken charges:
elementType: S O N N N N C C C C C C C C H H H H H H H H H H H H H H
charge: 0.185124 -0.229976 -0.047600 -0.018985 -0.434507 -0.400432 0.213670 -0.682025 -0.681535 -0.678161 -0.147090 -0.109313 0.284683 -0.597518 0.233057 0.229945 0.199363 0.229356 0.218543 0.214215 0.213741 0.233676 0.216842 0.316206 0.301565 0.279861 0.226260 0.231035
chargesum: 0.00000
title: Mulliken charges with hydrogens summed into heavy atoms:
elementType: S O N N N N C C C C C C C C
charge: 0.185124 -0.229976 -0.047600 -0.018985 -0.118301 -0.098867 0.213670 -0.019661 -0.019421 -0.013901 -0.147090 -0.109313 0.284683 0.139638
polarizability: 2.10930618e+02 3.53214497e+00 1.20911581e+02 5.40536598e+00 -1.07673986e+00 9.32747467e+01
1716.lowfreq: -6.8452 -3.9815 -0.0007 0.0010 0.0013 3.2676 21.5427 29.7954 42.3032
frequency: 21.3589 29.7338 42.2978 67.3017 91.6842 113.0162 148.0638 181.2114 189.9710 217.4274 236.3895 252.0864 266.1037 294.7876 309.8169 319.7929 347.1039 386.9320 418.7101 426.2787 461.3703 515.8694 527.9268 568.3497 596.4441 617.5895 621.7058 680.4780 727.2859 791.2870 813.4434 904.5214 924.8539 931.9377 953.4104 972.9494 1003.6582 1021.6860 1035.3111 1073.3245 1125.7526 1138.1394 1150.1024 1204.6943 1207.8032 1218.4979 1252.4989 1374.6533 1378.1116 1399.2379 1425.9944 1438.6099 1450.1422 1451.2422 1454.5807 1462.6892 1462.9215 1472.0490 1477.8158 1485.5161 1497.2592 1502.3265 1514.8060 1683.4872 2977.5068 2980.0910 2981.1648 2991.9021 3060.8175 3074.5631 3079.7157 3084.3994 3087.9475 3093.1512 3105.4142 3114.7241 3546.5852 3557.3776
redmass: 3.7048 5.1126 3.9191 4.4310 1.2016 3.8964 3.4261 3.6914 1.0549 2.6060 3.3335 1.1778 1.1592 3.1449 3.6203 4.0305 2.6543 3.8172 3.3091 1.4246 3.7016 1.4703 3.2344 7.9661 7.5480 8.0652 6.4369 7.8202 6.1134 6.0580 3.5784 4.6260 1.7443 1.6787 1.2027 3.8083 5.2920 1.3906 1.5453 5.4609 1.2860 1.6026 3.0711 2.8735 2.4288 3.1024 3.2596 1.1821 1.1879 1.3143 1.1591 1.7387 2.8220 1.0488 1.3810 1.0490 1.0849 1.0505 1.0569 1.0571 1.2351 2.8585 1.7782 7.0641 1.0345 1.0348 1.0353 1.0360 1.1027 1.1004 1.0996 1.1009 1.1003 1.0995 1.1000 1.0981 1.0769 1.0771
irintensity: 2.1344 2.0959 6.4178 2.0079 1.7458 0.6195 1.9181 4.6375 0.0279 1.7310 1.3421 0.7271 0.1226 4.9264 4.3789 7.0299 1.7168 28.1541 4.1793 58.9128 10.1188 166.5653 33.9776 8.0225 23.5605 0.9353 33.2735 10.8939 24.8007 18.4873 2.3016 4.4339 2.2874 2.2776 0.1318 38.1539 80.5404 0.0622 7.5702 56.8281 0.6509 59.7543 92.0699 7.9373 326.4308 2.7283 12.1068 18.5992 23.4993 11.2405 31.8755 164.6019 210.8603 0.4852 236.0575 1.8302 5.6776 12.7889 20.2472 28.1998 121.5961 311.3809 27.2698 203.5202 23.3095 28.7208 82.6159 30.6636 37.5046 0.3036 60.7709 14.2775 9.8733 68.8928 26.7958 2.1953 14.6097 35.2130
temp: 298.150 k
press: 1.00000 atm
elementType: 16 8 7 7 7 7 6 6 6 6 6 6 6 6 1 1 1 1 1 1 1 1 1 1 1 1 1 1
symmnumber: 1
zpe: 580594.1 jmol-1
zpe.correction: 0.221137 hartree
zpe.thermalcorrener: 0.237429 hartree
zpe.thermalcorrenthalpy: 0.238373 hartree
zpe.thermalcorrgfe: 0.175822 hartree
zpe.sumelectzpe: -1004.438912 hartree
zpe.sumelectthermal: -1004.422619 hartree
zpe.sumelectthermalent: -1004.421675 hartree
zpe.sumelectthermalfe: -1004.484226 hartree
dipole: -1.0948 -5.5458 -1.4545
dipole: 5.8369
quadrupole: -61.1647 -96.0552 -93.1683
quadrupole: 10.1610 8.7004 2.7446
quadrupole: 22.2980 -12.5925 -9.7056 10.1610 8.7004 2.7446
hfenergy: -1004.6600486 hartree
pointgroup: C01 [X(C8H14N4O1S1)]
dipole: 0.4869359 -1.9812121 1.0541775 debye
polarizability: 211.2412351|-1.3109695|119.8388273|2.3986772|-5.2505818|94.0368834 unknown
InChI: InChI=1S/C8H14N4OS/c1-8(2,3)5-11-12-7(14-5)10-6(13)9-4/h9-10H,1-4H3
charge 0 multiplicity 1
28 atoms
S  -0.756104 -1.56632 0.116312
O  2.890871 0.63849 -1.248405
N  -1.156316 1.074868 0.230367
N  0.232293 0.922286 0.372095
N  1.941431 -0.780258 0.406254
N  4.260692 -0.506576 0.273258
C  -3.349792 -0.173683 0.007931
C  -3.975202 1.246674 0.033759
C  -3.893689 -1.00713 1.206211
C  -3.716425 -0.881363 -1.330444
C  -1.839447 -0.057127 0.118546
C  0.621743 -0.349094 0.326184
C  3.034912 -0.132463 -0.26906
C  5.522885 -0.051048 -0.320897
H  -3.601562 1.860327 -0.803006
H  -3.725611 1.774609 0.969452
H  -5.074302 1.159962 -0.04743
H  -3.643045 -0.525967 2.168326
H  -4.993792 -1.084305 1.131802
H  -3.476625 -2.030912 1.21142
H  -3.305476 -1.90675 -1.373119
H  -3.325278 -0.316631 -2.195113
H  -4.815821 -0.946548 -1.42507
H  2.12036 -1.680772 0.853397
H  4.286386 -0.951694 1.191485
H  5.280085 0.472647 -1.258819
H  6.188754 -0.904249 -0.544601
H  6.051676 0.656725 0.344465
