program: Gaussian 09
title: 000179413
version: EM64L-G09RevD.01
frameworkgroup: C1[X(C15H18O2)]
method: RPBEPBE
basis: SDD
operation: Freq
keyword: #pfreq=noraman
keyword: PBEPBE/SDD
title: #p freq=noraman PBEPBE/SDD
converged: YES YES NO NO
title: Mulliken charges:
elementType: O O C C C C C C C C C C C C C C C H H H H H H H H H H H H H H H H H H
charge: -0.238810 -0.246294 -0.651859 0.243341 -0.490807 -0.557326 -0.062169 0.470774 -0.324886 0.425036 0.291060 0.031704 -0.368966 -0.815123 -0.339255 -0.827582 -0.784924 0.247305 0.238918 0.223928 0.210023 0.221768 0.225598 0.218868 0.244518 0.220114 0.255003 0.225917 0.271847 0.238767 0.286836 0.209607 0.210605 0.232083 0.264381
chargesum: 0.00000
title: Mulliken charges with hydrogens summed into heavy atoms:
elementType: O O C C C C C C C C C C C C C C C
charge: -0.238810 -0.246294 -0.165637 0.243341 -0.056856 -0.109961 -0.062169 0.470774 -0.106018 0.425036 0.291060 0.031704 -0.124448 -0.114089 -0.067408 -0.092371 -0.077855
polarizability: 2.19476157e+02 -6.69176433e+00 1.64952914e+02 7.54468320e+00 6.12375481e+00 1.15598221e+02
1716.lowfreq: -9.9872 -6.9792 0.0004 0.0007 0.0008 9.6655 46.5011 73.7429 91.4372
frequency: 46.3585 73.7327 91.4310 104.8443 129.6468 134.2564 142.9590 155.0555 161.7427 206.5096 215.2992 251.1583 259.5662 296.5242 312.4882 326.5879 354.5463 373.4497 384.9863 416.8785 446.7127 472.2270 492.2560 562.2461 576.1232 590.1265 606.8560 650.5238 723.5048 746.1928 754.4552 768.6569 794.9528 836.0615 850.6386 867.5937 885.1959 914.8984 930.1915 954.6169 975.8470 986.5087 1005.0761 1008.9179 1027.6530 1042.6044 1047.8119 1050.0183 1063.2668 1096.6663 1108.6197 1140.9400 1168.4367 1194.2722 1199.9671 1230.2922 1231.4498 1257.2096 1263.6709 1310.3037 1318.7540 1365.9216 1368.2003 1386.6118 1398.4195 1401.3954 1407.3388 1442.4749 1450.8408 1453.3443 1462.0427 1466.7780 1468.0628 1470.3258 1474.7661 1481.2929 1518.3790 1531.0576 1596.4986 1626.3431 1679.2568 2962.7632 2963.1380 2973.0673 2990.1037 2990.7811 3001.2735 3012.7990 3031.7796 3042.8279 3049.8773 3058.0729 3074.1721 3075.2288 3097.6298 3101.2231 3106.5104 3124.9973 3256.6248
redmass: 4.9372 3.4077 2.9179 1.9123 1.4829 1.4097 2.1988 1.2306 2.1844 3.6156 3.1481 5.8607 4.2399 2.7246 3.6711 3.1838 4.1983 2.3773 3.7055 2.4253 3.5186 3.4049 3.2276 2.5222 2.6262 4.1180 3.3637 4.6935 4.8736 1.4610 4.5524 3.3005 3.0232 4.0473 2.0917 1.5599 1.8424 1.9113 2.1972 1.8180 2.7462 1.6442 1.6689 2.5165 1.7013 1.6589 1.4991 1.6915 4.0150 2.2329 3.0412 1.5467 1.1870 1.4576 1.6405 1.5877 2.0555 3.0016 1.1962 1.5209 1.8130 1.6720 1.8526 1.5293 1.7972 1.3022 1.3702 1.1546 1.1328 1.0532 1.1011 1.0711 1.1023 1.1077 1.0773 1.0821 5.9410 5.4703 5.9127 6.0970 6.6900 1.0584 1.0391 1.0398 1.0588 1.0372 1.0607 1.0997 1.0955 1.0957 1.0994 1.0986 1.0969 1.0973 1.0996 1.0959 1.0974 1.0892 1.1005
irintensity: 2.6150 0.2388 0.5318 2.2006 0.1669 1.6807 0.0345 0.4177 2.0742 0.5249 1.6056 1.6129 6.5137 0.2557 0.7031 4.8289 0.7108 0.9540 1.6720 1.6312 0.5532 1.5833 6.2723 6.5968 8.8626 6.4622 3.8183 3.5681 4.3123 33.7765 39.1540 21.2502 1.0235 7.1637 9.9468 23.1098 12.9348 11.4933 16.9993 6.1945 14.3723 6.4575 8.4583 47.7595 4.8338 0.7618 6.0327 3.7230 22.8337 8.7788 0.7136 3.0152 14.1959 7.1430 0.3043 11.0200 0.7822 45.4105 1.6344 4.2168 2.3350 3.6620 16.9397 61.9084 23.1446 25.3724 41.6145 62.4520 27.6056 13.4726 5.8996 8.5248 17.5118 9.9808 2.3757 34.5374 59.9507 126.6871 18.5993 134.0888 7.2990 24.7623 21.3132 22.8689 26.5776 31.8048 57.1385 11.9975 21.1806 16.6244 24.1187 8.1123 47.4908 23.2383 15.3317 24.6804 2.2198 9.1933 0.4612
temp: 298.150 k
press: 1.00000 atm
elementType: 8 8 6 6 6 6 6 6 6 6 6 6 6 6 6 6 6 1 1 1 1 1 1 1 1 1 1 1 1 1 1 1 1 1 1
symmnumber: 1
zpe: 759344.9 jmol-1
zpe.correction: 0.289219 hartree
zpe.thermalcorrener: 0.306023 hartree
zpe.thermalcorrenthalpy: 0.306967 hartree
zpe.thermalcorrgfe: 0.245892 hartree
zpe.sumelectzpe: -731.527251 hartree
zpe.sumelectthermal: -731.510447 hartree
zpe.sumelectthermalent: -731.509503 hartree
zpe.sumelectthermalfe: -731.570578 hartree
dipole: -2.0760 -1.7421 -0.6952
dipole: 2.7978
quadrupole: -88.2888 -109.0232 -99.9933
quadrupole: -1.5804 -0.0370 -0.8301
quadrupole: 10.8130 -9.9214 -0.8915 -1.5804 -0.0370 -0.8301
hfenergy: -731.8164698 hartree
pointgroup: C01 [X(C15H18O2)]
dipole: -0.8591455 -0.5959038 -0.3441191 debye
polarizability: 218.7072038|-10.5234568|163.4891063|5.1056217|12.2741699|117.8309821 unknown
InChI: InChI=1S/C15H18O2/c1-10-5-4-6-11(2)8-14-15(13(16)7-10)12(3)9-17-14/h6-7,9H,4-5,8H2,1-3H3
charge 0 multiplicity 1
35 atoms
O  2.482973 -1.941021 -0.345585
O  0.825212 2.19978 0.853518
C  0.069002 -2.229108 -0.39112
C  1.243855 -1.270991 -0.290393
C  -3.500395 -0.609372 -0.208687
C  -3.266193 0.882145 -0.719367
C  1.482969 0.102913 -0.115742
C  -1.226194 -1.723585 0.23892
C  -2.300539 -1.454283 -0.560055
C  -2.025467 1.477019 -0.074438
C  2.939861 0.286451 -0.05385
C  0.509173 1.220882 0.092943
C  -0.803012 1.09821 -0.580127
C  -1.185983 -1.515376 1.740421
C  3.495616 -0.963516 -0.215043
C  -2.223705 2.272552 1.195313
C  3.685208 1.582607 0.12288
H  -0.106657 -2.469431 -1.459246
H  0.402816 -3.171927 0.088234
H  -4.418561 -0.984703 -0.698652
H  -3.693326 -0.588248 0.878873
H  -4.1696 1.475083 -0.482797
H  -3.16003 0.848684 -1.820223
H  -2.201375 -1.682339 -1.633833
H  -0.790705 0.50609 -1.502547
H  -2.145284 -1.157666 2.146875
H  -0.401225 -0.791807 2.031231
H  -0.938236 -2.46918 2.247121
H  4.515588 -1.333769 -0.258499
H  -2.600104 3.284954 0.945139
H  -1.284197 2.407267 1.752807
H  -2.991578 1.801494 1.840105
H  4.776061 1.41914 0.076464
H  3.410183 2.311888 -0.66084
H  3.428654 2.051959 1.086997
