program: Gaussian 09
title: 000179392
version: EM64L-G09RevD.01
frameworkgroup: C1[X(C13H9NO2)]
method: RPBEPBE
basis: SDD
operation: Freq
keyword: #p
keyword: freq=noraman
keyword: PBEPBE/SDD
title: #p freq=noraman PBEPBE/SDD
converged: NO YES YES YES
title: Mulliken charges:
elementType: O O N C C C C C C C C C C C C C H H H H H H H H H
charge: -0.204263 -0.199051 0.011061 -0.658140 0.124527 0.252821 0.340211 0.134008 0.228092 -0.418694 -0.427557 -0.377537 -0.410166 -0.191905 -0.232116 -0.235286 0.270923 0.270883 0.248880 0.250819 0.238757 0.285235 0.238137 0.229995 0.230365
chargesum: 0.00000
title: Mulliken charges with hydrogens summed into heavy atoms:
elementType: O O N C C C C C C C C C C C C C
charge: -0.204263 -0.199051 0.011061 -0.116333 0.124527 0.252821 0.340211 0.134008 0.228092 -0.169813 -0.176737 -0.138780 -0.124931 0.046232 -0.002121 -0.004922
polarizability: 2.41818758e+02 -1.10628648e+01 1.74534959e+02 -1.12250891e-02 -1.42246696e-02 6.10934807e+01
1716.lowfreq: -8.8195 -3.2369 -0.0003 0.0005 0.0008 4.8336 51.2727 86.9610 111.2057
frequency: 51.2595 86.9547 111.2051 148.0476 189.4935 252.1679 254.4215 278.2054 350.6942 375.1619 424.0746 470.5712 473.5843 478.4649 551.7788 567.9121 568.7038 627.0686 652.7417 684.9652 705.0790 728.6293 732.8245 774.6429 794.6088 821.6725 827.1989 865.1755 872.1071 925.4504 938.1189 963.4854 990.7588 993.8313 1018.3195 1040.0891 1064.3613 1107.1708 1130.9438 1153.0104 1170.1753 1173.4354 1182.4517 1199.6156 1216.2926 1227.4100 1287.4561 1306.0665 1360.8610 1384.8611 1392.0886 1414.8602 1439.1591 1445.8755 1467.7245 1482.8237 1579.3073 1594.1141 1619.5722 1624.6252 3005.4997 3045.7437 3126.0960 3133.1293 3140.1266 3146.3854 3161.3716 3164.7925 3188.5974
redmass: 11.8690 5.4039 4.3488 7.3792 4.3110 5.8943 2.1497 4.5250 10.0312 8.1939 2.8772 2.9789 3.8540 5.5176 6.3567 3.8473 5.7191 6.4171 7.2497 3.0193 4.4003 8.9773 1.7404 1.6629 4.3925 1.7254 5.2357 6.5891 1.3873 1.7735 1.5204 1.6395 1.3412 1.3506 2.6375 4.1231 1.9985 1.9168 1.1386 2.0329 1.2152 1.2953 1.9092 2.3782 6.6409 1.8483 2.0216 1.9045 4.6255 4.7732 4.3037 1.2818 2.3923 3.1352 2.8932 4.3908 6.7194 6.8462 8.5698 7.3041 1.0630 1.0973 1.0856 1.0897 1.0884 1.0948 1.0943 1.1003 1.0956
irintensity: 0.1472 0.4183 1.7256 2.1098 1.3122 0.7542 8.6671 0.0774 1.2031 0.0439 7.1137 2.6843 0.0768 2.4139 0.6832 0.1126 0.7286 10.6801 6.6886 1.4200 29.2502 17.3194 16.7548 89.7405 1.5908 29.9072 2.0530 4.8942 0.3179 1.3698 0.0287 5.6752 0.4290 2.3421 7.5338 0.1022 11.6661 3.0409 0.0424 4.2677 7.6932 34.0519 16.8202 7.0264 184.1774 54.4713 3.6635 7.6356 59.1027 95.6454 12.7058 16.1460 18.9283 14.5202 19.3558 3.4394 5.2433 0.2708 2.6775 3.5959 2.6159 1.1963 2.5352 2.8084 5.1425 24.9256 18.8861 31.7927 5.1336
temp: 298.150 k
press: 1.00000 atm
elementType: 8 8 7 6 6 6 6 6 6 6 6 6 6 6 6 6 1 1 1 1 1 1 1 1 1
symmnumber: 1
zpe: 488826.9 jmol-1
zpe.correction: 0.186184 hartree
zpe.thermalcorrener: 0.197926 hartree
zpe.thermalcorrenthalpy: 0.198870 hartree
zpe.thermalcorrgfe: 0.147926 hartree
zpe.sumelectzpe: -704.828817 hartree
zpe.sumelectthermal: -704.817075 hartree
zpe.sumelectthermalent: -704.816131 hartree
zpe.sumelectthermalfe: -704.867074 hartree
dipole: 4.0207 2.9338 0.0011
dipole: 4.9773
quadrupole: -97.6115 -82.8386 -94.8860
quadrupole: -10.5949 -0.0060 -0.0051
quadrupole: -5.8328 8.9401 -3.1073 -10.5949 -0.0060 -0.0051
hfenergy: -705.0150009 hartree
pointgroup: C01 [X(C13H9N1O2)]
dipole: 1.5726042 -1.1668445 -0.0004443 debye
dipolederiv: -1.0326022 0.0365793 -0.0002516 0.0798964 -0.4355361 -0.0000936 0.0005829 0.0000351 -0.2297072 -0.5413229 -0.0267022 0.0001444 0.035388 -0.7988368 0.0002567 -0.0001256 -0.0003674 -0.2138541 1.5778758 -0.2481162 0.0000616 -0.4211984 1.2797635 -0.0000717 -0.0000682 0.0000025 0.1770541 0.0429033 -0.0139769 -0.0000116 -0.051158 -0.1110675 0.0000384 -0.0000927 0.0000419 0.1014852 -0.1479652 -0.2046863 -0.0000235 0.3230372 0.1897053 -0.0000635 -0.000181 0.0000266 -0.0159833 0.5125233 0.2869501 0.0000014 0.0395991 -0.2258308 0.0000497 0.0001363 0.0000844 0.0150573 0.089881 -0.1231475 0.0000507 -0.1865923 -0.0428103 -0.0000148 0.0000959 -0.0000104 -0.0243437 0.0284338 -0.090848 0.0000209 0.1227543 -0.0823578 0.000034 -0.0000414 -0.0000311 -0.0064235 -0.1395824 0.2883278 0.0000446 0.4069014 -0.2943355 -0.0000247 -0.0001911 0.0001627 0.0567852 0.0580448 -0.0917732 0.0000343 -0.0761607 0.0710281 -0.0000613 0.0000317 -0.0000537 -0.1309901 -0.0909034 0.0679349 -0.0000059 0.0807126 0.1696918 -0.0000672 -0.0000108 -0.0000545 -0.1652195 0.0069772 0.0516059 0.0000105 -0.0577428 0.0925655 -0.0000559 0.0000383 -0.0000515 -0.1489675 -0.1915715 0.0069331 0.000036 -0.4179696 0.0330693 -0.0000529 -0.0001076 0.000072 -0.1275876 -0.2710282 0.1342967 -0.0000217 0.2465288 0.1317761 -0.0000428 -0.0000783 -0.0000786 -0.1378677 -0.0495855 0.0012051 0.0000191 0.1098503 0.044344 -0.0000277 -0.0000062 -0.0000401 -0.1579529 0.0299868 -0.0953982 0.0000489 -0.2207243 -0.0901029 -0.0000415 0.0000792 -0.000024 -0.1580786 0.0066767 0.0127392 0.0213994 -0.0040667 0.0706785 -0.0628765 0.0418118 -0.0728949 0.0287954 0.0066847 0.0126728 -0.0214156 -0.0040846 0.0706887 0.0628741 -0.0417739 0.0729072 0.0286627 0.0275613 0.1114913 -0.000038 0.0778003 0.001772 0.0000397 -0.0000615 0.0000734 0.1505777 0.0849759 0.0273835 -0.0000159 -0.0279884 -0.1004134 0.0000534 -0.0000021 0.0000563 0.1557028 0.0979724 -0.0322617 -0.0000029 0.0184424 -0.0982707 0.0000568 -0.0000122 0.0000465 0.1543578 0.0442664 -0.0306694 -0.0000245 -0.0026049 0.1281936 0.0000085 0.0000017 0.0000264 0.1717309 0.0442019 -0.0670255 0.0000066 -0.0705265 -0.0821995 0.0000316 0.0000515 0.000022 0.1558463 -0.090684 -0.0926204 -0.0000147 -0.0957013 0.038594 0.0000122 -0.000017 0.000011 0.1608589 -0.1037199 0.0791056 -0.0000525 0.0956076 0.0398909 0.0000391 -0.0000599 0.0000381 0.1600615 unknown
polarizability: 241.9912395|10.5238785|174.3624778|0.0111111|-0.0143139|61.0934807 unknown
InChI: InChI=1S/C13H9NO2/c15-14(16)13-7-3-6-11-10-5-2-1-4-9(10)8-12(11)13/h1-7H,8H2
charge 0 multiplicity 1
25 atoms
O  -4.29194 0.780969 0.000236
O  -2.557718 2.257821 0.000157
N  -3.029329 1.052318 -0.000738
C  0.135452 1.444305 -0.000379
C  -0.677195 0.159286 -0.00021
C  0.200138 -0.97179 0.000156
C  1.571239 0.939783 -0.000059
C  1.592477 -0.486303 0.000249
C  -2.066824 -0.075069 -0.000357
C  -0.309894 -2.28833 0.000365
C  2.772739 1.669513 -0.000043
C  2.816108 -1.19178 0.000573
C  -2.594452 -1.391143 -0.000142
C  -1.710926 -2.489234 0.000215
C  4.001496 0.963638 0.000282
C  4.021938 -0.454415 0.000588
H  -0.102107 2.075159 0.876713
H  -0.101849 2.074748 -0.877838
H  0.36798 -3.148544 0.000642
H  2.765366 2.765129 -0.000278
H  2.839189 -2.287271 0.00081
H  -3.678999 -1.524604 -0.000259
H  -2.117245 -3.50564 0.000378
H  4.946751 1.517473 0.0003
H  4.982603 -0.980919 0.000838
