program: Gaussian 09
title: 000179386
version: EM64L-G09RevD.01
frameworkgroup: C1[X(C10H14O)]
method: RPBEPBE
basis: SDD
operation: Freq
keyword: #pfreq=noraman
keyword: PBEPBE/SDD
title: #p freq=noraman PBEPBE/SDD
converged: YES YES NO NO
title: Mulliken charges:
elementType: O C C C C C C C C C C H H H H H H H H H H H H H H
charge: -0.458291 -0.217845 -0.379192 -0.345148 0.435597 -0.699205 -0.449962 -0.387711 -0.218978 -0.226245 -0.241998 0.188127 0.209401 0.213699 0.182310 0.240156 0.205998 0.213415 0.216343 0.233254 0.265643 0.340991 0.225554 0.225484 0.228606
chargesum: 0.00000
title: Mulliken charges with hydrogens summed into heavy atoms:
elementType: O C C C C C C C C C C
charge: -0.117300 -0.029719 0.043908 0.077318 0.435597 -0.063449 -0.216709 -0.122068 0.006576 -0.000761 -0.013392
polarizability: 1.40642024e+02 6.75531047e+00 9.67176950e+01 -9.12157994e+00 1.39635341e+01 8.54528965e+01
1716.lowfreq: -10.7552 -4.4198 -0.0008 -0.0008 -0.0007 10.2096 34.3327 73.6375 83.7860
frequency: 34.2865 73.6263 83.7737 91.6958 185.5057 220.4025 230.5835 278.4288 312.4688 342.8068 360.4776 403.8871 509.3683 540.0619 615.5715 616.7303 706.2353 739.1799 767.9107 803.1580 846.9469 855.5162 894.4181 925.0919 940.4473 977.9513 988.8867 995.7744 1010.8861 1024.9094 1065.1690 1071.0528 1102.8179 1115.0330 1171.5661 1182.3787 1199.2448 1212.6428 1256.6790 1267.0415 1288.7081 1300.0833 1333.8152 1342.3513 1366.0208 1386.7024 1388.4907 1440.7305 1448.4199 1474.9109 1477.0505 1480.1260 1486.6822 1593.4559 1612.1126 2928.2121 2969.3606 2971.8862 2981.2702 3030.1708 3048.6663 3070.7083 3073.5266 3112.8652 3124.1503 3136.2416 3147.5139 3162.6991 3558.9432
redmass: 3.6192 3.6007 1.6951 2.8425 3.5760 2.0279 1.5619 4.1520 1.7928 1.6722 2.8748 2.7802 3.2888 2.7998 6.3952 5.4857 1.7414 1.1744 1.8541 3.1292 1.8343 1.2457 1.6312 1.4680 2.1217 1.3879 6.2231 1.3301 3.2080 2.1384 2.2526 1.6244 1.6198 1.9587 1.0577 1.1181 2.0298 1.5404 1.2566 1.3139 1.1718 1.3123 1.2796 1.4113 1.6501 4.9349 1.3021 2.1373 1.0885 1.0490 1.0461 2.2811 1.0847 6.0833 6.1040 1.0841 1.0432 1.0573 1.0606 1.0953 1.1006 1.0992 1.1007 1.0872 1.0860 1.0913 1.0958 1.1014 1.0660
irintensity: 0.5239 0.2088 0.2266 0.7369 0.3453 1.2582 2.1587 0.7519 67.2682 76.6937 29.0243 1.4738 3.5709 29.3458 0.7733 7.4413 53.4668 3.2856 46.0616 15.5562 10.2018 0.1888 2.6642 5.9537 18.8060 0.1850 0.5559 1.9211 44.0417 9.0596 16.3835 8.3884 11.2140 11.9865 0.1394 0.4830 6.6210 10.4901 4.7500 24.4992 2.4432 10.3548 1.7101 3.2551 15.1040 0.6199 9.4735 11.9379 4.9159 5.7592 9.8978 9.6848 14.8685 0.6507 3.5423 44.5633 40.6246 17.3880 46.1838 10.4079 1.2606 56.3713 83.0990 9.1762 0.0542 17.3608 33.6344 22.7284 5.4362
temp: 298.150 k
press: 1.00000 atm
elementType: 8 6 6 6 6 6 6 6 6 6 6 1 1 1 1 1 1 1 1 1 1 1 1 1 1
symmnumber: 1
zpe: 560788.3 jmol-1
zpe.correction: 0.213593 hartree
zpe.thermalcorrener: 0.224963 hartree
zpe.thermalcorrenthalpy: 0.225908 hartree
zpe.thermalcorrgfe: 0.175598 hartree
zpe.sumelectzpe: -463.842936 hartree
zpe.sumelectthermal: -463.831566 hartree
zpe.sumelectthermalent: -463.830621 hartree
zpe.sumelectthermalfe: -463.880931 hartree
dipole: -1.2676 -0.7645 -0.5525
dipole: 1.5800
quadrupole: -65.2083 -65.6106 -65.0555
quadrupole: -1.7475 -0.6839 2.8422
quadrupole: 0.0832 -0.3191 0.2359 -1.7475 -0.6839 2.8422
hfenergy: -464.0565291 hartree
pointgroup: C01 [X(C10H14O1)]
dipole: -0.4937527 -0.2971924 -0.2330252 debye
dipolederiv: -0.5229177 -0.0854346 0.2330959 -0.0997021 -0.7336199 0.1488073 0.2812052 0.1190795 -0.4240818 0.3644413 0.0256093 -0.0963013 0.0616581 0.6257065 -0.1180868 -0.1876575 -0.1088384 0.4115576 -0.0958081 0.0385017 -0.0377146 -0.0875164 0.1051937 0.0468418 0.0609643 0.0651406 0.004465 0.0529724 -0.0118943 -0.0088318 0.0396508 0.1274287 0.0529095 -0.122881 0.0580764 0.1000653 0.1645671 -0.0073983 0.0006281 0.0529841 -0.1287894 0.0408293 -0.0260232 0.028635 -0.0920374 -0.0695001 0.0327547 -0.0586891 0.0163568 0.0939043 0.019366 -0.0056016 0.0195726 0.0278505 -0.128879 -0.0270627 -0.0576731 -0.0477871 -0.0333587 0.1138573 -0.0296456 0.1035954 -0.0637168 -0.1445527 0.0674173 0.0194111 0.1019232 -0.0380746 0.0624796 0.0245461 0.0727881 -0.0972835 -0.0066 0.0785449 0.0162668 0.1048196 0.0250431 0.0886378 0.0240147 0.0944731 -0.0726081 0.000708 -0.0252933 -0.0792301 -0.034361 0.000448 0.1234584 -0.0764956 0.1248092 -0.0210297 0.0418632 0.0390674 -0.0680507 0.0256744 -0.1129424 0.0401512 -0.0709833 0.0302164 -0.1122066 0.0088798 -0.0135946 0.0262538 0.0352791 -0.1070554 -0.0972375 0.0358198 -0.091082 -0.1361367 0.0442789 -0.050184 0.0083446 -0.0718453 -0.1253214 0.0756875 0.0369712 0.0384785 0.0549792 0.0315996 0.0360226 0.0269729 0.0203556 0.0198894 -0.1155254 0.0449047 -0.0781987 -0.0748083 0.0221136 0.0022368 -0.0137904 0.0338654 -0.0053299 -0.135398 0.0299378 -0.1137587 -0.1392784 0.0674102 -0.0325814 0.0127639 -0.0698708 -0.0932973 0.0751234 0.0145729 0.0561751 0.0496874 0.0803567 -0.0756477 0.0117368 -0.013008 -0.1602353 0.0960745 -0.0224155 0.0652586 0.0449314 0.0950096 0.0358911 0.0346461 0.0086242 -0.0058912 -0.1341016 -0.0213362 -0.1026184 -0.104766 -0.2405667 0.0076236 0.040402 0.0029227 0.0947482 0.0126183 0.0613565 0.010411 0.0588583 0.0571989 0.0571843 0.0926651 0.0386339 0.0367229 -0.0983664 0.0757127 -0.1049103 0.0245795 0.0641328 -0.0858204 -0.0312424 -0.0804861 0.0289064 -0.0682192 -0.0346662 -0.0626483 0.1025728 0.1737918 0.0955014 -0.2006842 0.0678075 0.2661271 0.0065165 -0.2302667 0.0084996 0.2254742 0.0116333 -0.1016707 -0.0239979 -0.114162 -0.0125838 -0.0910499 -0.0316252 -0.0938799 0.0933425 0.0409281 0.0406145 0.0748682 0.0482773 0.0220636 -0.120326 0.0913676 -0.1153074 0.0282014 -0.1130611 -0.0403876 0.0781501 -0.0400938 0.1103173 -0.0250474 0.0782239 -0.023967 0.1113882 unknown
polarizability: 140.6921119|7.324705|95.8348457|-8.4471521|14.3267279|86.2856577 unknown
InChI: InChI=1S/C10H14O/c1-2-6-10(11)9-7-4-3-5-8-9/h3-5,7-8,10-11H,2,6H2,1H3
charge 0 multiplicity 1
25 atoms
O  1.198675 1.644749 -0.993763
C  0.874479 0.218261 -0.761536
C  1.870186 -0.265275 0.31231
C  3.342147 -0.195108 -0.14906
C  -0.580625 0.038823 -0.338039
C  4.324328 -0.642595 0.954477
C  -1.359665 -1.022538 -0.860959
C  -1.167184 0.924559 0.60313
C  -2.698417 -1.206438 -0.444984
C  -2.505327 0.745468 1.016384
C  -3.275103 -0.322145 0.495557
H  1.050816 -0.359285 -1.697542
H  1.607693 -1.305474 0.590364
H  1.728206 0.355978 1.218771
H  3.474576 -0.8356 -1.045727
H  3.565813 0.840289 -0.464335
H  4.126366 -1.685081 1.269415
H  4.232769 0.000797 1.849939
H  5.372367 -0.588014 0.606733
H  -0.918092 -1.706376 -1.597462
H  -0.568143 1.75314 0.997575
H  0.522989 2.023914 -1.611687
H  -3.291054 -2.030993 -0.857291
H  -2.949898 1.435452 1.742888
H  -4.313902 -0.460306 0.81604
