program: Gaussian 09
title: 000179349
version: EM64L-G09RevD.01
frameworkgroup: C1[X(C2H6N2OS)]
method: RPBEPBE
basis: SDD
operation: Freq
keyword: #p
keyword: freq=noraman
keyword: PBEPBE/SDD
title: #p freq=noraman PBEPBE/SDD
converged: YES YES NO NO
title: Mulliken charges:
elementType: S O N N C C H H H H H H
charge: -0.010459 -0.259629 -0.368304 -0.502404 -0.777261 0.283730 0.257992 0.293392 0.326092 0.310851 0.307953 0.138047
chargesum: 0.00000
title: Mulliken charges with hydrogens summed into heavy atoms:
elementType: S O N N C C
charge: 0.127587 -0.259629 -0.042212 0.116400 -0.225877 0.283730
polarizability: 7.11670974e+01 2.14026787e+00 5.40927801e+01 -3.19689309e+00 -1.48797030e+00 3.85907075e+01
1716.lowfreq: -2.7056 0.0020 0.0032 0.0032 10.5750 15.1569 32.3375 138.4736 150.9927
frequency: 31.9211 138.4272 150.9685 236.0039 258.1807 277.6910 379.6629 540.1754 593.5793 689.3674 704.0539 767.0772 809.3614 927.5807 966.4001 1104.6812 1183.0902 1243.4535 1285.7233 1298.4452 1435.5160 1445.4127 1618.4957 1678.1169 2419.6416 3038.2151 3112.0898 3399.1828 3516.5218 3548.7787
redmass: 5.2575 2.5021 1.3972 1.9356 4.3128 1.4375 3.4244 2.2577 1.5345 6.5034 1.9708 1.6291 1.8414 3.0786 2.0720 1.8056 1.6103 1.3858 1.1636 1.9039 1.1849 1.5261 7.2403 1.0647 1.0375 1.0572 1.1070 1.0428 1.0990 1.0797
irintensity: 4.2019 15.9302 12.4055 3.7173 28.8644 52.4210 6.9413 98.5320 74.3085 4.4602 23.2683 119.4143 2.0386 20.6707 2.3464 11.6753 8.0150 10.2241 1.0402 36.0237 40.4085 122.1675 165.0852 26.4974 5.3198 16.0287 7.3406 0.8497 2.9011 33.3961
temp: 298.150 k
press: 1.00000 atm
elementType: 16 8 7 7 6 6 1 1 1 1 1 1
symmnumber: 1
zpe: 232062.5 jmol-1
zpe.correction: 0.088388 hartree
zpe.thermalcorrener: 0.096099 hartree
zpe.thermalcorrenthalpy: 0.097043 hartree
zpe.thermalcorrgfe: 0.055517 hartree
zpe.sumelectzpe: -662.079342 hartree
zpe.sumelectthermal: -662.071631 hartree
zpe.sumelectthermalent: -662.070687 hartree
zpe.sumelectthermalfe: -662.112213 hartree
dipole: -1.4072 -1.8109 0.7784
dipole: 2.4219
quadrupole: -46.3036 -43.3146 -42.7530
quadrupole: 0.0792 0.6519 -2.8454
quadrupole: -2.1799 0.8091 1.3707 0.0792 0.6519 -2.8454
hfenergy: -662.1677298 hartree
pointgroup: C01 [X(C2H6N2O1S1)]
dipole: -0.3987232 -0.8652457 0.0160354 debye
dipolederiv: -0.2708233 -0.0001513 -0.0757301 0.00688 -0.0974007 0.1114282 -0.097791 0.0626037 0.0244538 -0.6144222 0.0491595 0.0989661 -0.1537875 -0.7291677 -0.2770918 -0.0631713 -0.2676501 -0.5801972 -0.4660071 -0.3307504 -0.1643371 -0.410085 -0.4108215 0.0726637 -0.2437356 0.0857796 -0.3760397 -0.3744227 -0.144891 -0.0568835 -0.1812608 -0.2305558 -0.1320671 -0.1600621 -0.1476587 -0.1135653 -0.1911028 0.0891758 0.0527854 0.1701412 0.1483468 -0.1666282 0.0856825 -0.0312557 0.0603329 1.1336162 0.3011269 0.030135 0.2883546 0.787479 0.5317194 0.1990927 0.4645371 0.489788 0.059182 -0.0677307 -0.0003053 -0.0204012 -0.0520038 -0.078811 0.0320744 -0.0892177 0.0285191 0.0165665 -0.0056415 -0.0004474 -0.0076577 0.0355397 0.0553569 -0.0260919 0.0974243 -0.0651214 0.1033075 0.0574134 0.0414442 0.0783501 0.2205792 -0.1064088 0.058969 -0.1057867 0.2687003 0.1913405 -0.0365941 0.0743414 0.0885954 0.0508145 0.0804565 0.134235 0.0310322 0.2254007 0.2095341 0.0640385 -0.0589255 0.1658254 0.2567164 -0.0519842 0.0424377 0.0115143 0.0361117 0.2032313 0.024845 0.0589568 -0.0249545 0.0204739 -0.0386335 0.0383606 -0.1113224 0.0016173 unknown
polarizability: 65.6060508|8.2290222|53.6496345|-9.5871823|3.4389803|44.5948997 unknown
InChI: InChI=1S/C2H6N2OS/c3-4-2(5)1-6/h4,6H,1,3H2
charge 0 multiplicity 1
12 atoms
S  2.305242 0.586464 -1.181227
O  -0.183157 0.914295 0.880028
N  -1.161209 -0.873345 -0.241127
N  -2.498813 -0.498162 0.05261
C  1.293728 -0.703037 -0.232284
C  -0.063021 -0.138697 0.184333
H  1.214644 -1.572632 -0.904373
H  1.855905 -0.991316 0.670598
H  -1.056896 -1.696669 -0.836118
H  -2.694588 0.445338 -0.311319
H  -2.669053 -0.535221 1.067291
H  2.063717 1.595479 -0.25961
