program: Gaussian 09
title: 000179354
version: EM64L-G09RevD.01
frameworkgroup: C1[X(C10H12N2O4)]
method: RPBEPBE
basis: SDD
operation: Freq
keyword: #p
keyword: freq=noraman
keyword: PBEPBE/SDD
title: #p freq=noraman PBEPBE/SDD
converged: YES YES NO NO
title: Mulliken charges:
elementType: O O O O N N C C C C C C C C C C H H H H H H H H H H H H
charge: -0.220985 -0.228143 -0.225376 -0.222913 -0.362854 -0.368133 0.100274 -0.589863 -0.539283 0.178594 0.188861 0.303171 -0.030528 0.163698 -0.782532 -0.593773 0.270105 0.288356 0.253188 0.232583 0.366355 0.364108 0.264046 0.243504 0.259602 0.243401 0.224130 0.220410
chargesum: 0.00000
title: Mulliken charges with hydrogens summed into heavy atoms:
elementType: O O O O N N C C C C C C C C C C
charge: -0.220985 -0.228143 -0.225376 -0.222913 0.003501 -0.004025 0.100274 -0.031402 -0.053512 0.178594 0.188861 0.303171 0.233517 0.163698 -0.036025 -0.149233
polarizability: 1.71019047e+02 1.45531668e+00 1.10275205e+02 -4.38874291e+00 3.73275703e+00 1.14691020e+02
1716.lowfreq: -23.2655 0.0003 0.0004 0.0006 4.3940 8.7338 15.2942 41.2289 69.4608
frequency: -21.6207 41.2241 69.4351 75.8582 85.2823 95.9416 122.4499 148.3208 157.5708 172.9456 209.8217 259.1389 270.0410 291.9263 352.8058 361.6163 379.3831 439.5487 450.2832 476.7263 488.4632 566.7679 598.7566 618.1830 634.8980 649.5025 684.5265 729.6693 755.6555 771.5489 789.5420 799.4984 832.7152 901.7394 924.7100 956.3401 957.2843 959.6586 991.7653 1008.3360 1017.8367 1063.7576 1108.9979 1157.8277 1191.9477 1202.0015 1226.8404 1272.5499 1296.8265 1312.9315 1325.0923 1333.4761 1368.1990 1372.8619 1378.3126 1378.7100 1403.8625 1429.1192 1442.3960 1452.9285 1462.4359 1613.6623 1622.2361 1649.5926 1656.6217 1678.9456 2969.5957 2983.4192 3009.9203 3047.7966 3063.3896 3071.3131 3086.2353 3117.6082 3126.2350 3196.4418 3522.5722 3524.5407
redmass: 1.6573 8.5976 3.7355 3.6286 2.7986 2.0779 5.2418 4.1269 5.7020 6.8824 3.7798 2.7366 4.4125 3.3127 3.1650 8.4756 6.9693 2.6964 2.1208 4.4113 8.1237 4.0129 4.4968 2.6332 3.0097 2.7022 2.5939 3.5047 1.8377 4.1948 1.8904 2.1260 2.8627 1.6858 2.6365 1.4756 1.4891 1.7999 3.4625 1.2748 3.0075 2.0052 2.6569 2.7955 2.2401 2.4900 1.4302 1.7364 1.2935 1.4613 2.5698 2.2735 8.8144 1.2661 1.8652 1.7098 1.1125 1.1796 1.0814 1.0495 1.1005 6.8139 7.2770 8.3185 4.7313 5.3674 1.0624 1.0377 1.0602 1.0987 1.0970 1.0980 1.0609 1.0939 1.0999 1.1142 1.0758 1.0779
irintensity: 2.3943 0.9421 1.7556 1.0434 0.2420 1.4606 0.2718 2.0293 0.2261 14.4612 0.7401 4.0951 12.8232 6.1098 6.6891 22.6082 4.4192 4.9067 0.7588 38.1118 17.4394 17.7966 1.4251 5.3028 3.1249 1.6093 36.7577 17.7750 7.3670 8.2690 201.9567 1.1366 0.1697 6.2575 4.8743 55.4940 32.5097 6.3112 0.9445 30.7157 4.8390 5.9711 16.2998 7.9574 61.3157 22.9692 27.7010 34.6644 16.6155 30.4017 153.7363 193.9039 209.9728 61.3503 9.2384 4.9389 72.4913 3.2607 31.3843 24.9173 15.2103 328.7751 101.9992 65.3235 4.0887 643.7363 16.3766 1.5547 7.3396 6.9556 3.7710 3.3127 8.1093 3.4145 10.1108 18.8969 86.1736 51.1251
temp: 298.150 k
press: 1.00000 atm
elementType: 8 8 8 8 7 7 6 6 6 6 6 6 6 6 6 6 1 1 1 1 1 1 1 1 1 1 1 1
symmnumber: 1
zpe: 557572.9 jmol-1
zpe.correction: 0.212368 hartree
zpe.thermalcorrener: 0.227657 hartree
zpe.thermalcorrenthalpy: 0.228602 hartree
zpe.thermalcorrgfe: 0.169554 hartree
zpe.sumelectzpe: -797.501195 hartree
zpe.sumelectthermal: -797.485906 hartree
zpe.sumelectthermalent: -797.484962 hartree
zpe.sumelectthermalfe: -797.544010 hartree
dipole: -3.7931 -0.6342 0.6332
dipole: 3.8975
quadrupole: -96.7270 -90.3183 -100.0040
quadrupole: -4.3349 0.2071 -1.2075
quadrupole: -1.0439 5.3648 -4.3209 -4.3349 0.2071 -1.2075
hfenergy: -797.7135633 hartree
pointgroup: C01 [X(C10H12N2O4)]
dipole: -0.5411628 1.3492143 -0.4879116 debye
polarizability: 124.5772289|-24.597142|154.6622241|9.8129752|-8.9634469|116.7458181 unknown
InChI: InChI=1S/C10H12N2O4/c1-3-4-10(5-6(2)13)7(14)11-9(16)12-8(10)15/h3,11-12H,1,4-5H2,2H3
charge 0 multiplicity 1
28 atoms
O  -0.30716 -0.977831 -2.305505
O  0.130173 0.846904 2.142968
O  -1.846215 -1.439045 0.681548
O  2.527085 -2.906748 0.831581
N  1.159097 -1.861641 -0.749143
N  1.396879 -0.946016 1.416456
C  0.044572 0.331214 -0.259774
C  -1.441204 0.747703 -0.288954
C  0.953561 1.483502 -0.872338
C  0.242912 -0.889674 -1.176956
C  0.482918 0.097248 1.19472
C  -2.343802 -0.354855 0.266766
C  0.769818 2.837882 -0.219776
C  1.750556 -1.970376 0.521257
C  -3.83545 -0.088435 0.28989
C  0.461569 3.967809 -0.90414
H  -1.741435 0.975814 -1.329045
H  -1.581347 1.670654 0.302606
H  0.717357 1.545579 -1.950721
H  2.012991 1.165387 -0.784642
H  1.349507 -2.63677 -1.392392
H  1.752768 -1.054001 2.371844
H  0.919937 2.88484 0.867555
H  -4.206738 0.099359 -0.735557
H  -4.371782 -0.947117 0.721287
H  -4.054678 0.819772 0.882552
H  0.371118 4.934989 -0.397074
H  0.29979 3.961551 -1.989914
