program: Gaussian 09
title: 000179307
version: EM64L-G09RevD.01
frameworkgroup: C1[X(C20H14N2O4)]
method: RPBEPBE
basis: SDD
operation: Freq
keyword: #p
keyword: freq=noraman
keyword: PBEPBE/SDD
title: #p freq=noraman PBEPBE/SDD
converged: YES YES NO NO
title: Mulliken charges:
elementType: O O O O N N C C C C C C C C C C C C C C C C C C C C H H H H H H H H H H H H H H
charge: -0.194408 -0.195282 -0.211153 -0.222349 0.106753 0.015801 -0.489497 -0.113474 0.180639 -0.465630 0.379693 -0.611367 0.470125 -0.029030 0.371766 0.070199 0.319211 -0.484361 -0.429794 -0.398704 -0.434675 0.196168 -0.347912 -0.481526 -0.257415 -0.257854 0.252009 0.278604 0.236358 0.268331 0.219167 0.252819 0.245211 0.305160 0.239156 0.229794 0.227253 0.287570 0.236115 0.236531
chargesum: 0.00000
title: Mulliken charges with hydrogens summed into heavy atoms:
elementType: O O O O N N C C C C C C C C C C C C C C C C C C C C
charge: -0.194408 -0.195282 -0.211153 -0.222349 0.106753 0.015801 -0.237488 0.165130 0.180639 0.039058 0.379693 -0.139381 0.470125 -0.029030 0.371766 0.070199 0.319211 -0.239150 -0.124634 -0.159548 -0.204882 0.196168 -0.120659 -0.193956 -0.021300 -0.021324
polarizability: 3.86371449e+02 -2.05996472e+01 2.90427917e+02 2.50343336e+01 2.42457739e+01 1.30509145e+02
1716.lowfreq: -8.9424 -0.0006 -0.0005 -0.0003 5.3527 14.4235 22.2081 32.6784 43.1933
frequency: 21.9147 32.6485 43.1585 57.3093 61.2614 67.1482 113.0314 148.2436 181.3160 185.8319 209.4723 242.7954 273.0015 295.5511 307.5416 317.7842 330.4644 352.9584 368.0894 395.7773 433.7811 441.0241 460.6664 477.5513 510.2672 524.3449 532.3082 545.9455 571.5550 576.6863 592.2104 616.3185 633.3422 639.3291 667.6576 682.7923 692.7522 709.0804 730.2859 741.0691 764.7190 777.8454 785.7627 820.0548 842.3261 848.8035 860.4821 863.8338 868.8057 887.8110 916.8432 924.5441 959.4787 963.1616 985.7457 992.8054 995.2597 1000.7242 1039.9850 1048.1809 1070.0977 1078.3994 1118.1309 1145.8303 1166.0657 1169.4458 1177.2990 1183.1234 1191.9606 1205.8745 1208.0397 1212.3051 1216.6113 1242.4863 1251.3121 1261.8269 1276.5005 1289.3445 1309.9049 1314.3182 1329.3790 1333.6390 1355.4944 1365.8784 1384.3953 1395.9052 1407.7621 1421.8256 1427.7162 1451.9550 1460.7935 1467.4003 1473.1315 1493.3918 1529.5236 1580.3857 1581.6602 1594.1421 1616.0373 1623.9377 2918.9965 2965.7601 3018.1604 3056.7742 3074.8998 3090.3803 3125.1419 3134.2752 3141.0594 3157.8621 3168.5518 3175.5866 3189.1264 3209.8450
redmass: 11.4272 12.9957 11.2115 5.5432 6.7493 5.6320 4.7337 3.6556 6.0017 6.2837 5.0356 4.9228 5.8829 4.1126 4.6997 4.6793 6.3244 5.5929 5.2669 6.7370 4.5016 4.4125 4.2466 3.4133 4.8041 4.0490 4.3848 5.6957 4.6725 5.7809 4.6551 4.7063 5.7694 5.1048 5.8026 4.9411 5.9337 4.4651 2.5910 5.7986 2.7309 4.4476 2.5673 3.5536 1.9260 2.8446 1.9328 2.9655 1.8512 2.4977 4.6222 2.9668 1.6876 3.0302 1.3961 1.3631 1.3599 3.5242 2.3219 2.5608 2.8863 2.7639 3.0388 1.7370 1.6944 1.4146 1.7968 1.2215 1.9259 1.7305 2.0117 1.7841 1.7806 2.2736 1.9774 1.6034 1.4706 1.4357 2.0412 1.5740 2.1173 2.3207 1.7856 3.8198 5.7396 6.5489 4.2409 3.5900 2.7248 2.9580 1.3222 2.4410 1.1161 2.8227 5.1648 5.3626 7.5831 7.4257 6.2934 8.0247 1.0810 1.0675 1.0609 1.0936 1.0932 1.0968 1.0875 1.0912 1.0884 1.0935 1.0933 1.0938 1.0948 1.0931
irintensity: 1.1086 0.7387 0.3194 1.8495 0.3602 1.4822 3.7606 1.8597 2.8054 1.5802 0.9811 0.0914 0.7729 1.2123 0.4836 2.5967 0.0533 0.3138 2.7395 0.2391 1.2677 1.3425 3.4377 0.5990 1.1018 0.7451 5.6442 3.7480 6.7850 0.8864 0.3119 1.7536 4.3309 2.7618 2.7151 0.8996 1.7665 0.3148 20.6145 20.2246 21.4269 4.1101 57.9123 5.4378 31.4570 16.6089 10.1296 21.8829 12.1312 6.2074 10.9854 1.2107 3.4947 4.8500 1.8987 1.6363 0.3530 3.9616 5.6697 0.2819 2.1085 6.3751 14.7546 7.1740 94.3079 20.1514 208.8402 61.9298 220.8610 78.2383 39.5152 57.2980 44.6260 28.9532 8.2276 10.2751 30.8468 5.9553 13.9209 12.3727 48.7570 21.6814 3.7418 40.7635 0.3124 5.6436 17.5436 6.5266 66.1926 4.1110 9.7915 20.0768 9.0578 2.4144 80.9888 51.3918 48.4153 17.3385 0.3472 4.8300 10.9226 26.7912 28.2222 28.2437 0.4227 15.1403 8.6805 15.6498 7.5843 17.6327 6.0602 25.1509 5.5711 6.7504
temp: 298.150 k
press: 1.00000 atm
elementType: 8 8 8 8 7 7 6 6 6 6 6 6 6 6 6 6 6 6 6 6 6 6 6 6 6 6 1 1 1 1 1 1 1 1 1 1 1 1 1 1
symmnumber: 1
zpe: 782005.4 jmol-1
zpe.correction: 0.297850 hartree
zpe.thermalcorrener: 0.317433 hartree
zpe.thermalcorrenthalpy: 0.318377 hartree
zpe.thermalcorrgfe: 0.248345 hartree
zpe.sumelectzpe: -1179.010461 hartree
zpe.sumelectthermal: -1178.990878 hartree
zpe.sumelectthermalent: -1178.989934 hartree
zpe.sumelectthermalfe: -1179.059966 hartree
dipole: -7.0142 -0.9608 -4.3806
dipole: 8.3254
quadrupole: -174.1777 -121.0766 -160.1659
quadrupole: 1.0892 9.3321 4.4502
quadrupole: -22.3710 30.7301 -8.3591 1.0892 9.3321 4.4502
hfenergy: -1179.3083111 hartree
pointgroup: C01 [X(C20H14N2O4)]
dipole: 2.7370751 0.4133503 -1.7510549 debye
polarizability: 387.6021064|-17.9965667|286.8142637|-24.3681164|-31.210987|132.8921413 unknown
InChI: InChI=1S/C20H14N2O4/c23-21(24)16-10-8-14-12-3-1-2-4-13(12)20-17(22(25)26)9-6-11-5-7-15(16)19(14)18(11)20/h1-5,7-8,10,17,20H,6,9H2
charge 0 multiplicity 1
40 atoms
O  3.361559 0.657634 2.044527
O  1.298079 1.613149 2.232768
O  -5.205091 -1.536987 0.919943
O  -5.111303 0.446794 -0.182416
N  2.366922 1.328126 1.57639
N  -4.538633 -0.603681 0.315625
C  1.659466 0.725036 -0.788872
C  2.459499 1.764834 0.102755
C  0.171926 0.979495 -0.666195
C  1.94339 3.217233 -0.077458
C  -0.248825 2.301555 -0.88543
C  0.82443 3.332236 -1.155707
C  2.091265 -0.718926 -0.591777
C  -0.758425 -0.049318 -0.312676
C  -0.287304 -1.394041 -0.056365
C  1.149232 -1.726713 -0.227752
C  -2.173261 0.287801 -0.208493
C  -1.628194 2.620104 -0.777625
C  -2.572889 1.641806 -0.459012
C  3.445584 -1.066193 -0.810523
C  -1.225696 -2.366073 0.341316
C  -3.073211 -0.774342 0.183331
C  1.6242 -3.062734 -0.072312
C  -2.596716 -2.062039 0.464135
C  3.896298 -2.389876 -0.656007
C  2.974084 -3.393753 -0.276544
H  1.971624 1.025739 -1.81489
H  3.533642 1.671004 -0.120323
H  2.789334 3.878104 -0.335378
H  1.525523 3.559641 0.8848
H  1.269398 3.178584 -2.161061
H  0.406751 4.353941 -1.14636
H  -1.956807 3.652366 -0.943544
H  -3.629331 1.89888 -0.397319
H  4.160778 -0.28964 -1.105294
H  -0.912171 -3.387852 0.564436
H  0.932336 -3.863272 0.20174
H  -3.313329 -2.825991 0.774679
H  4.948852 -2.638568 -0.825972
H  3.307717 -4.428763 -0.148341
