program: Gaussian 09
title: 000179275
version: EM64L-G09RevD.01
frameworkgroup: C1[X(C8H5ClO6S)]
method: RPBEPBE
basis: SDD
operation: Freq
keyword: #p
keyword: freq=noraman
keyword: PBEPBE/SDD
title: #p freq=noraman PBEPBE/SDD
converged: NO YES NO NO
title: Mulliken charges:
elementType: Cl S O O O O O O C C C C C C C C H H H H H
charge: -0.187130 0.889073 -0.446456 -0.446465 -0.433224 -0.433217 -0.220255 -0.220261 -0.073917 0.287162 0.287159 -0.291395 -0.291347 -0.464329 0.129666 0.129671 0.331299 0.331294 0.320155 0.401259 0.401259
chargesum: 0.00000
title: Mulliken charges with hydrogens summed into heavy atoms:
elementType: Cl S O O O O O O C C C C C C C C
charge: -0.187130 0.889073 -0.446456 -0.446465 -0.031965 -0.031958 -0.220255 -0.220261 -0.073917 0.287162 0.287159 0.039904 0.039946 -0.144174 0.129666 0.129671
polarizability: 1.90605533e+02 2.76922051e-03 1.71005157e+02 7.26129679e-01 3.37776894e-03 9.63944738e+01
1716.lowfreq: -6.3237 0.0020 0.0022 0.0031 3.0699 9.0340 28.4590 49.1635 54.2788
frequency: 27.4875 49.1406 54.2780 62.2723 90.6661 116.0094 128.4730 169.7562 188.9732 195.7523 215.0024 234.4085 242.6174 302.9776 320.6074 389.3005 405.0113 414.4053 444.1231 483.5464 507.5963 542.8916 594.5423 598.6744 612.4819 617.1850 667.6409 728.8990 746.2682 748.8971 831.6087 848.8532 947.4829 957.8608 969.2196 979.8371 1000.5775 1022.8945 1064.2622 1085.5490 1118.5874 1171.7001 1255.8271 1305.8523 1330.2994 1389.9744 1425.5740 1449.3246 1556.8830 1614.9185 1647.9421 1657.5796 3165.6634 3176.7283 3178.2371 3538.4946 3538.6963
redmass: 16.5539 13.7698 13.2485 11.3226 10.9359 9.4196 8.9859 10.5142 5.1515 7.4076 10.0675 7.7489 16.3469 11.9262 8.2964 15.3408 6.8144 15.5964 3.4174 9.0739 4.6562 4.8826 5.0823 1.3911 4.4235 1.2451 2.8015 3.3911 7.4461 8.4050 18.0400 8.6308 1.5358 1.4535 14.4675 6.0673 1.4573 4.1239 2.3788 1.7560 1.3547 2.1087 1.2238 2.2764 2.5675 8.6245 4.1029 4.2109 7.2707 7.2035 9.6860 9.6199 1.0929 1.0927 1.0943 1.0645 1.0646
irintensity: 0.0344 4.3286 0.0012 0.5634 4.1202 1.6683 0.0399 0.2517 0.0596 5.6640 0.5441 1.2823 0.8097 3.8633 0.1606 43.5098 16.3292 143.1802 0.0220 0.9488 5.3441 46.2337 81.2845 297.3327 5.0984 0.0003 26.6844 77.0705 0.0096 3.1593 66.1183 19.0934 19.2183 1.8294 29.7495 6.2663 10.2948 22.1293 533.3291 23.9973 136.5948 0.8442 6.0835 181.8699 29.0727 1.5996 2.1680 0.0014 32.7856 27.3093 2.5672 444.2632 8.7671 22.8978 10.4125 139.4831 2.6589
temp: 298.150 k
press: 1.00000 atm
elementType: 17 16 8 8 8 8 8 8 6 6 6 6 6 6 6 6 1 1 1 1 1
symmnumber: 1
zpe: 323771.2 jmol-1
zpe.correction: 0.123318 hartree
zpe.thermalcorrener: 0.139177 hartree
zpe.thermalcorrenthalpy: 0.140121 hartree
zpe.thermalcorrgfe: 0.077861 hartree
zpe.sumelectzpe: -1616.019436 hartree
zpe.sumelectthermal: -1616.003577 hartree
zpe.sumelectthermalent: -1616.002632 hartree
zpe.sumelectthermalfe: -1616.064893 hartree
dipole: -3.0594 0.0000 -0.1668
dipole: 3.0640
quadrupole: -136.4434 -84.3731 -109.5677
quadrupole: 0.0056 3.1198 -0.0011
quadrupole: -26.3154 25.7550 0.5604 0.0056 3.1198 -0.0011
hfenergy: -1616.1427536 hartree
pointgroup: C01 [X(C8H5Cl1O6S1)]
dipole: -1.1951349 0.0026601 0.1574492 debye
dipolederiv: -0.4096644 0.0004198 0.0896162 0.0003829 -0.2122482 -0.0001201 0.3091539 -0.0005853 -0.7524692 1.6697868 -0.0016638 -0.1280335 -0.0016787 0.8968401 0.0001344 -0.1711131 0.0002016 1.6366853 -0.6242267 0.0169034 0.0124489 0.0367872 -0.453012 0.1413482 -0.0594806 0.0524935 -0.4774336 -0.624455 -0.016166 0.0118141 -0.0360024 -0.4527424 -0.1413876 -0.0597175 -0.0522129 -0.4774927 -0.4238417 0.3940958 -0.0056874 0.2301632 -1.1938576 0.0379546 -0.0025289 0.0202446 -0.4050923 -0.426545 -0.3974369 -0.0061278 -0.2334898 -1.1911324 -0.0384927 -0.0027701 -0.0207475 -0.4051359 -0.9872501 -0.0976041 -0.0151405 -0.2937466 -0.7057209 0.0059231 -0.0275549 -0.0030536 -0.3095785 -0.9855486 0.0988459 -0.0150313 0.2949723 -0.7074482 -0.006156 -0.0273291 0.0028928 -0.3095812 0.3103103 -0.0012377 -0.0682419 -0.0011655 -0.2603154 0.0000961 -0.0674882 0.0001216 -0.1678179 -0.2346213 -0.0702057 -0.002247 -0.1985281 -0.3883041 0.0113546 -0.0321664 -0.001332 0.0265193 -0.2334804 0.0695532 -0.0022389 0.1978927 -0.3894845 -0.0116646 -0.0319919 0.0011387 0.026504 -0.1619917 -0.0550537 0.042202 -0.2540559 0.0035752 0.0083191 0.0462066 0.0123304 -0.0379619 -0.1606365 0.0557541 0.042201 0.2546479 0.0022274 -0.0084408 0.0463282 -0.0125108 -0.0379546 0.0091868 0.0002878 0.0130879 0.0002898 0.1418744 0.0000471 0.0000015 0.0000702 -0.04572 1.2625215 0.0350433 0.0422656 0.3606941 1.8578484 -0.0371463 0.0397716 0.0003675 0.2432622 1.2607829 -0.0324832 0.0423148 -0.3581225 1.8596006 0.0381376 0.0394589 0.0006057 0.2432877 0.1658785 -0.0531263 -0.0153575 -0.0280734 0.161042 0.0087127 0.008035 -0.0090526 0.1444149 0.1662102 0.0531096 -0.0153416 0.0280619 0.1606859 -0.0086394 0.0081044 0.0090303 0.1443993 0.0909088 0.0001661 -0.0037467 0.0001755 0.1692869 0.0000136 0.0067016 -0.0000033 0.1519363 0.167932 -0.1319043 -0.0094428 -0.0542778 0.3510491 -0.0068335 -0.0108465 -0.0064555 0.4046075 0.1687436 0.1327026 -0.0093135 0.0550733 0.3502358 0.0068398 -0.0107747 0.0064567 0.4046213 unknown
polarizability: 189.9439727|-0.0424658|171.0052365|-7.8997141|0.0519096|97.0559539 unknown
InChI: InChI=1S/C8H5O6S.Cl/c9-7(10)4-1-5(8(11)12)3-6(2-4)15(13)14;/h1-3,9,11H;
charge 0 multiplicity 1
21 atoms
Cl 3.491707 -0.007399 -2.111492
S  2.965459 -0.006564 0.24789
O  3.450388 -1.421544 0.858161
O  3.456603 1.406088 0.858578
O  -0.95206 -3.620269 0.019693
O  -0.936306 3.624389 0.022406
O  -3.022824 -2.564421 -0.087621
O  -3.011618 2.577581 -0.085589
C  1.077283 -0.002402 0.11927
C  -0.986313 -1.2261 0.016018
C  -0.980925 1.230389 0.017034
C  0.435618 1.241052 0.084469
C  0.430174 -1.2430 0.083398
C  -1.684249 0.003695 -0.019639
C  -1.775999 -2.494762 -0.023834
C  -1.765104 2.502493 -0.021846
H  0.987049 2.184927 0.119737
H  0.977465 -2.189311 0.117819
H  -2.778057 0.006139 -0.074557
H  -1.504067 -4.446867 -0.009288
H  -1.484725 4.45339 -0.006008
