program: Gaussian 09
title: 000179312
version: EM64L-G09RevD.01
frameworkgroup: C1[X(C16H10ClF9N2OS)]
method: RPBEPBE
basis: SDD
operation: Freq
keyword: #p
keyword: freq=noraman
keyword: PBEPBE/SDD
title: #p freq=noraman PBEPBE/SDD
converged: NO YES NO NO
title: Mulliken charges:
elementType: Cl S F F F F F F F F F O N N C C C C C C C C C C C C C C C C H H H H H H H H H H
charge: 0.073201 0.470469 -0.153181 -0.156743 -0.153641 -0.158111 -0.151143 -0.153961 -0.144026 -0.151094 -0.153799 -0.236212 -0.176647 -0.059078 -0.029976 0.175909 0.300514 -0.681873 -0.694734 -0.134898 -0.467421 -0.509051 0.328138 0.327550 -0.409649 0.452655 0.255903 0.240273 -0.679362 0.270641 0.231580 0.225463 0.284315 0.207590 0.219733 0.226951 0.274639 0.286674 0.305027 0.297375
chargesum: 0.00000
title: Mulliken charges with hydrogens summed into heavy atoms:
elementType: Cl S F F F F F F F F F O N N C C C C C C C C C C C C C C C C
charge: 0.073201 0.470469 -0.153181 -0.156743 -0.153641 -0.158111 -0.151143 -0.153961 -0.144026 -0.151094 -0.153799 -0.236212 -0.176647 -0.059078 0.201604 0.175909 0.300514 0.035495 0.026590 -0.134898 -0.180747 -0.204024 0.328138 0.327550 -0.112274 0.452655 0.255903 0.240273 -0.679362 0.270641
polarizability: 3.50357483e+02 -1.16234889e+01 2.15458135e+02 -1.23652552e+01 1.84090174e+01 1.48146261e+02
1716.lowfreq: -17.0379 -12.8018 -5.8877 -3.4325 -0.0016 -0.0015 -0.0013 1.0304 9.0959
frequency: -16.9579 -12.5399 7.5761 17.2177 19.8528 35.0130 45.6874 77.0738 87.5447 91.6530 102.8175 105.7456 117.9660 138.8494 142.5755 147.7791 166.0903 183.6059 200.0397 206.3835 214.4102 231.8274 234.6337 272.7120 274.2062 297.2644 300.0633 304.6106 310.3591 332.6534 343.1773 361.2185 372.5550 379.9185 394.8970 408.3750 435.6791 438.4214 460.0432 466.0148 475.6829 478.9415 505.1848 512.0054 542.0952 563.3481 589.0337 607.4769 613.0765 616.3615 633.2181 634.6763 640.5933 689.6912 696.9183 718.5909 731.3000 776.2204 794.2827 836.5569 880.2103 913.0684 926.5785 941.5272 945.1263 952.6626 956.1795 962.7295 988.5691 988.6832 998.0844 1002.4050 1024.7258 1031.5003 1040.1921 1061.0272 1099.2999 1105.8921 1126.4479 1142.7903 1149.2750 1189.3547 1202.5324 1230.2060 1280.6420 1295.7696 1314.6898 1318.0161 1360.9110 1383.6848 1386.6606 1390.7527 1401.8095 1445.2259 1448.2770 1454.8427 1470.7584 1482.3180 1497.7901 1508.1117 1536.0226 1536.5691 1615.0749 1617.2622 2995.2776 2998.1208 3052.8820 3083.5710 3089.0141 3120.6490 3127.1812 3166.0669 3174.3116 3176.8785
redmass: 18.6152 18.7412 18.1477 15.8810 8.8953 10.7809 6.0061 8.3973 11.2974 15.0416 4.6594 4.5994 8.7356 15.7531 7.3085 8.1159 2.5421 9.8509 5.3459 1.6601 3.9004 8.2521 1.1082 9.7646 13.4627 5.6273 7.0346 9.0993 6.4393 6.8764 11.4272 9.7977 10.6313 11.3026 10.3624 5.5912 9.2334 11.3428 7.1545 5.8530 5.0431 10.8223 12.2130 7.9942 9.6970 7.2398 9.6727 13.6364 13.0129 10.9270 11.4190 9.3194 9.5374 12.0278 2.6292 7.7415 4.9986 10.0997 12.2405 5.1359 3.0704 1.7022 1.2274 1.5621 1.5314 1.8229 2.9963 9.1181 6.6579 11.2101 7.4602 8.9068 7.8735 8.9015 11.4612 8.3579 2.6210 2.1790 4.4425 2.4662 2.3830 2.2021 4.6523 2.4848 4.0473 1.2192 2.8289 1.8589 3.9965 1.2156 2.1945 5.1949 1.1997 3.9823 3.4270 1.0602 1.0821 1.0519 1.4334 2.7524 9.4739 10.5990 5.9919 6.4182 1.0370 1.0378 1.0841 1.0993 1.0991 1.0998 1.0987 1.0937 1.0921 1.0935
irintensity: 0.0608 0.0296 0.1184 0.2246 0.4312 0.6728 1.7731 0.7322 4.0837 0.8336 0.9671 1.6087 1.3501 0.5637 0.6256 0.6291 0.2523 0.3462 0.3124 0.0680 1.4144 2.5002 0.2393 0.6902 0.7703 0.0474 1.5596 0.9969 0.5597 2.1706 21.8744 11.1913 0.6738 3.6982 5.2859 11.1209 7.9580 0.0354 8.3188 3.9770 5.2141 1.6253 2.0922 8.1901 0.3408 12.0017 1.1492 34.1737 5.1099 13.9090 16.8104 8.2344 17.1999 4.4987 11.5761 31.1947 52.8451 11.5039 50.5406 40.2266 25.8533 76.7993 7.3597 36.3773 29.8968 13.8320 33.2639 58.8329 39.1422 188.6037 24.5466 343.5176 82.1501 8.0377 128.7300 177.9624 122.5869 204.1420 283.9537 19.2224 7.2205 60.7137 172.6417 440.3020 373.9498 0.1632 190.3819 126.1780 10.1336 33.1877 53.6898 5.2999 36.9591 6.0129 7.3255 1.1898 27.0945 5.1369 21.7566 76.4169 81.2436 152.9914 12.3824 6.9004 25.4558 11.9130 14.1452 18.8266 33.6150 1.4659 15.4104 2.8128 1.8762 1.9634
temp: 298.150 k
press: 1.00000 atm
elementType: 17 16 9 9 9 9 9 9 9 9 9 8 7 7 6 6 6 6 6 6 6 6 6 6 6 6 6 6 6 6 1 1 1 1 1 1 1 1 1 1
symmnumber: 1
zpe: 633841.2 jmol-1
zpe.correction: 0.241417 hartree
zpe.thermalcorrener: 0.268959 hartree
zpe.thermalcorrenthalpy: 0.269903 hartree
zpe.thermalcorrgfe: 0.180016 hartree
zpe.sumelectzpe: -2554.935591 hartree
zpe.sumelectthermal: -2554.908050 hartree
zpe.sumelectthermalent: -2554.907106 hartree
zpe.sumelectthermalfe: -2554.996993 hartree
dipole: -1.4483 0.3816 1.3063
dipole: 1.9873
quadrupole: -223.1736 -196.8904 -184.9983
quadrupole: -9.5489 -4.7452 1.8826
quadrupole: -21.4862 4.7971 16.6891 -9.5489 -4.7452 1.8826
hfenergy: -2555.1770087 hartree
pointgroup: C01 [X(C16H10Cl1F9N2O1S1)]
dipole: -0.5516753 0.3860016 -0.3974673 debye
polarizability: 348.8963738|-8.3252902|148.2607109|21.0087869|17.8617801|216.8047952 unknown
InChI: InChI=1S/C16H10ClF9N2OS/c1-6(2)28(13-27-10(11(17)30-13)16(24,25)26)12(29)7-3-8(14(18,19)20)5-9(4-7)15(21,22)23/h3-6H,1-2H3
charge 0 multiplicity 1
40 atoms
Cl 5.800417 -0.180874 2.859445
S  2.793077 0.140956 2.236988
F  -4.237829 2.576007 2.650697
F  -5.478269 2.650306 0.751615
F  -5.822399 0.997639 2.259394
F  -2.742151 -2.565447 -2.291087
F  -4.678765 -2.773356 -1.12368
F  -4.509515 -1.218538 -2.758873
F  6.994537 -0.169313 0.089272
F  5.704395 -1.016239 -1.573412
F  5.946862 1.225089 -1.362039
O  0.215421 0.360191 2.214376
N  1.000442 0.385206 0.015147
N  3.360171 0.215567 -0.383524
C  0.748228 0.734019 -1.450684
C  -0.036788 0.347268 0.967109
C  -1.473464 0.25688 0.522738
C  1.151649 -0.407762 -2.406191
C  1.399439 2.085027 -1.819354
C  2.33367 0.259108 0.449578
C  -1.920496 -0.68884 -0.429724
C  -2.418628 1.044418 1.221905
C  -3.299611 -0.821145 -0.693866
C  -3.791769 0.916383 0.932499
C  -4.246037 -0.01512 -0.026516
C  4.586956 0.075016 0.270955
C  -4.807642 1.772398 1.644742
C  -3.791144 -1.830508 -1.698745
C  4.512064 0.007329 1.651757
C  5.794104 0.02591 -0.616453
H  -0.344197 0.873037 -1.504422
H  0.792007 -0.165497 -3.422299
H  2.244755 -0.526562 -2.438023
H  0.704822 -1.373856 -2.109742
H  1.096059 2.882229 -1.117394
H  1.059708 2.373696 -2.83013
H  2.497424 2.013608 -1.831777
H  -1.20977 -1.338953 -0.94714
H  -2.074926 1.737615 1.994869
H  -5.314712 -0.116793 -0.24031
