program: Gaussian 09
title: 000179286
version: EM64L-G09RevD.01
frameworkgroup: C1[X(C12H4Cl4S2)]
method: RPBEPBE
basis: SDD
operation: Freq
keyword: #p
keyword: freq=noraman
keyword: PBEPBE/SDD
title: #p freq=noraman PBEPBE/SDD
converged: YES YES NO NO
title: Mulliken charges:
elementType: Cl Cl Cl Cl S S C C C C C C C C C C C C H H H H
charge: 0.038662 0.038662 0.057100 0.057101 0.317034 0.317034 -0.079113 -0.079112 -0.131171 -0.131170 -0.145006 -0.145005 -0.088709 -0.088711 -0.249978 -0.249979 -0.220548 -0.220547 0.261477 0.261477 0.240251 0.240251
chargesum: 0.00000
title: Mulliken charges with hydrogens summed into heavy atoms:
elementType: Cl Cl Cl Cl S S C C C C C C C C C C C C
charge: 0.038662 0.038662 0.057100 0.057101 0.317034 0.317034 -0.079113 -0.079112 -0.131171 -0.131170 -0.145006 -0.145005 -0.088709 -0.088711 0.011499 0.011498 0.019703 0.019703
polarizability: 2.98999755e+02 -1.38724654e-05 2.25938893e+02 1.03440655e+01 1.91095582e-05 9.70976360e+01
1716.lowfreq: -2.8319 -0.0021 -0.0020 0.0009 4.7699 5.4164 35.0602 45.4828 65.9768
frequency: 35.0602 45.4635 65.9763 80.0213 115.4573 162.5219 168.4296 193.3344 205.4715 215.4886 221.7308 251.4996 262.9293 302.0590 325.0439 326.7551 328.7637 377.5079 379.7290 429.7721 439.7577 456.0412 507.2625 581.1873 588.4788 601.1235 620.0142 637.4086 646.8640 701.3103 719.3983 737.8143 760.7474 810.7856 811.9567 869.0485 949.3033 989.6411 999.4192 1025.1789 1025.4340 1103.0095 1122.5067 1172.3229 1174.5672 1250.8878 1297.9343 1306.9038 1337.2740 1374.7138 1414.9839 1440.3712 1509.6651 1520.8841 1575.8366 1579.5627 3140.3012 3149.7937 3160.8866 3175.3075
redmass: 9.6497 11.0867 21.3135 27.6457 4.5945 11.7297 18.1063 22.7211 33.0915 24.2534 10.8282 10.5863 8.0516 18.9360 13.2553 19.7512 18.3457 24.2625 8.7471 9.6961 5.2261 6.3492 4.3134 12.2307 12.0222 11.5819 15.5616 12.6807 6.7439 5.4689 6.6354 9.8828 1.2137 12.8623 12.8564 1.3334 1.3758 1.3613 7.4637 10.8619 2.9236 2.6552 1.6014 8.1777 1.0963 1.4169 11.0911 11.4893 11.9916 11.1492 2.0241 2.2931 11.5231 11.7738 6.1730 7.0893 1.0857 1.0900 1.0953 1.1011
irintensity: 0.5911 0.0928 0.0678 0.0015 0.0132 0.1246 0.7659 0.4680 0.0165 0.1757 0.5171 3.3587 0.0049 0.4283 0.2821 0.0056 0.0079 0.2907 2.6404 3.3735 7.1166 8.5632 0.1613 0.0201 2.1312 12.7193 51.2600 24.7014 8.6582 0.2644 0.9645 0.3241 92.4636 1.5209 11.5111 0.1637 1.4570 0.2675 5.5895 5.5791 10.3546 11.8528 3.2839 7.7945 0.0603 1.6722 178.8564 179.8715 0.9681 0.8700 18.6454 45.2405 3.6200 1.1393 0.4186 6.3454 0.5224 3.2948 7.9867 22.6005
temp: 298.150 k
press: 1.00000 atm
elementType: 17 17 17 17 16 16 6 6 6 6 6 6 6 6 6 6 6 6 1 1 1 1
symmnumber: 1
zpe: 315687.9 jmol-1
zpe.correction: 0.120239 hartree
zpe.thermalcorrener: 0.136606 hartree
zpe.thermalcorrenthalpy: 0.137550 hartree
zpe.thermalcorrgfe: 0.074686 hartree
zpe.sumelectzpe: -3094.774500 hartree
zpe.sumelectthermal: -3094.758134 hartree
zpe.sumelectthermalent: -3094.757189 hartree
zpe.sumelectthermalfe: -3094.820054 hartree
dipole: 3.5850 0.0000 1.2874
dipole: 3.8091
quadrupole: -129.8599 -142.7068 -146.8749
quadrupole: 0.0000 8.1516 0.0000
quadrupole: 9.9539 -2.8929 -7.0610 0.0000 8.1516 0.0000
hfenergy: -3094.8947395 hartree
pointgroup: C01[X(C12H4Cl4S2)]
dipole: 1.442201 0.0000026 -0.4073136 debye
dipolederiv: -0.0466144 0.0151368 -0.0068052 0.0892497 -0.6552955 -0.0021356 -0.0273136 0.0048588 -0.0014959 -0.0466171 -0.0151495 -0.0068065 -0.0892606 -0.6552931 0.0020827 -0.027321 -0.004911 -0.0014965 -0.5613108 0.2741563 -0.1470172 0.3226788 -0.1670372 0.0887345 -0.1942422 0.0872702 -0.0347831 -0.5613234 -0.2741358 -0.1470414 -0.3226544 -0.1670098 -0.0887421 -0.1942704 -0.087277 -0.0347973 -0.3644663 -0.0566976 0.0198509 -0.0429239 0.1235601 0.0919978 0.025745 -0.0301252 0.0250056 -0.3644625 0.0567063 0.0198537 0.0429319 0.1235626 -0.09199 0.0257493 0.0301325 0.0250006 0.36947 0.2764461 0.1322111 0.5444763 -0.2745027 -0.0000519 0.0096246 0.0657834 -0.0298554 0.3694504 -0.2764703 0.1321885 -0.5444909 -0.2744802 0.000029 0.0095793 -0.0658035 -0.0298609 0.3936262 -0.2449141 -0.1877693 -0.4316993 -0.0839375 0.0251628 -0.0833098 0.1121429 -0.0232104 0.39364 0.2449188 -0.1877503 0.4316955 -0.0839405 -0.0251641 -0.0832783 -0.112146 -0.0232209 -0.2542256 -0.0068991 -0.0383714 -0.1467299 0.9536584 0.0315551 -0.0235497 0.0320019 -0.039172 -0.25422 0.0069281 -0.0383713 0.1467589 0.9536602 -0.0314737 -0.0235386 -0.0319212 -0.0391766 0.6379867 -0.4719098 0.1872978 -0.4602332 0.0293954 -0.162425 0.2442097 -0.1537568 0.0405389 0.6380052 0.4718817 0.187339 0.4602 0.0293498 0.16242 0.2442508 0.1537512 0.0405643 -0.2526916 0.0274706 0.0086248 0.1296222 0.0640215 -0.022469 0.018127 -0.0061478 -0.1001824 -0.2526945 -0.0274645 0.0086231 -0.1296174 0.0640222 0.0224822 0.0181169 0.0061602 -0.1001805 -0.0034758 0.0712485 -0.090265 -0.0325218 0.0057592 -0.0123346 -0.1002558 -0.035763 -0.0924638 -0.0034773 -0.0712409 -0.0902706 0.0325305 0.0057558 0.0123448 -0.1002531 0.0357737 -0.0924592 0.1162386 0.0342244 0.0333299 -0.0086006 -0.039301 0.0110095 0.0198269 -0.0067894 0.1389792 0.1162381 -0.0342302 0.0333268 0.0085957 -0.0392998 -0.0110246 0.0198278 0.0067748 0.1389788 -0.0345395 -0.0671342 0.088909 -0.0726085 0.0436746 0.0372574 0.1111348 0.0361724 0.1166471 -0.0345365 0.0671285 0.0889136 0.0726011 0.0436775 -0.0372652 0.1111404 -0.036181 0.1166407 unknown
polarizability: 299.4592865|-0.000916|225.9388927|3.7427532|0.0052129|96.638105 unknown
InChI: InChI=1S/C12H4Cl4S2/c13-7-8(14)10(16)12-11(9(7)15)17-5-3-1-2-4-6(5)18-12/h1-4H
charge 0 multiplicity 1
22 atoms
Cl -1.676967 3.213288 0.131845
Cl -1.677035 -3.213248 0.131585
Cl -4.301989 1.607963 -0.784909
Cl -4.302023 -1.607793 -0.785039
S  0.947538 1.649612 1.144198
S  0.947503 -1.64971 1.144065
C  -0.509396 0.708862 0.539674
C  -0.509411 -0.70888 0.539616
C  2.300286 0.704934 0.330674
C  2.300271 -0.704994 0.330616
C  -1.668557 1.407242 0.124083
C  -1.668586 -1.407201 0.123969
C  -2.829305 0.708083 -0.276874
C  -2.82932 -0.707986 -0.276931
C  3.36689 1.417399 -0.26225
C  3.366859 -1.417434 -0.262367
C  4.454374 0.707335 -0.818769
C  4.454359 -0.707347 -0.818827
H  3.344569 2.511483 -0.282984
H  3.344515 -2.511516 -0.28319
H  5.290325 1.258376 -1.261589
H  5.290298 -1.25837 -1.261693
