program: Gaussian 09
title: 000179272
version: EM64L-G09RevD.01
frameworkgroup: C1[X(C17H16O2)]
method: RPBEPBE
basis: SDD
operation: Freq
keyword: #pfreq=noraman
keyword: PBEPBE/SDD
title: #p freq=noraman PBEPBE/SDD
converged: YES YES NO NO
title: Mulliken charges:
elementType: O O C C C C C C C C C C C C C C C C C H H H H H H H H H H H H H H H H
charge: -0.281780 -0.214962 -0.419429 0.372285 0.438326 0.483236 -0.560588 -0.364098 -0.371208 -0.236087 -0.378783 -0.377365 -0.430360 0.317619 -0.218904 -0.222142 -0.238039 -0.830545 -0.195377 0.223331 0.223698 0.253714 0.256683 0.253292 0.210878 0.226765 0.256343 0.229672 0.228289 0.228566 0.230696 0.231351 0.278940 0.231380 0.164604
chargesum: 0.00000
title: Mulliken charges with hydrogens summed into heavy atoms:
elementType: O O C C C C C C C C C C C C C C C C C
charge: -0.281780 -0.214962 0.027600 0.372285 0.438326 0.483236 -0.306874 -0.107415 -0.117917 -0.009321 -0.167905 -0.121022 -0.200688 0.317619 0.009386 0.006424 -0.007343 -0.088874 -0.030774
polarizability: 3.47063624e+02 2.21511773e+01 1.97133695e+02 -8.73066756e+00 -5.97877487e+00 9.28820770e+01
1716.lowfreq: -9.7041 -2.1094 -0.0004 -0.0002 0.0009 5.0258 12.6740 17.8177 40.6467
frequency: 9.0201 17.5737 40.5754 44.4683 65.1195 98.5892 117.0558 181.6459 186.9254 200.3897 212.6634 252.1969 267.1652 285.1361 318.7057 339.2942 350.9819 401.1770 447.2201 452.5190 477.8619 493.3750 527.0680 608.2385 612.7927 617.4586 625.1684 690.8932 692.7254 701.9701 743.4704 769.7473 787.4072 822.8792 832.4111 854.1637 873.8105 880.0788 904.2602 915.8193 925.7369 973.4512 977.8753 977.9821 979.2326 990.1133 994.0733 996.3446 1011.6850 1027.8322 1033.7395 1036.4831 1086.5620 1106.2927 1165.5460 1173.0437 1187.3827 1196.0916 1199.1074 1204.4111 1225.6529 1263.2820 1313.7417 1318.4110 1357.2333 1365.1519 1381.6142 1388.5939 1392.1462 1408.8661 1437.7597 1441.4368 1471.8929 1473.3346 1482.7568 1487.2459 1491.3935 1574.0106 1589.1047 1596.7906 1613.7113 1618.5736 1628.4660 2866.6166 2938.5145 2977.0915 3001.8489 3057.1698 3060.5681 3088.4599 3115.4343 3129.1130 3138.8770 3142.4914 3146.2908 3157.7702 3169.1141 3169.7293 3212.2877
redmass: 3.0403 3.8760 4.7745 5.7968 4.9805 4.6245 5.4396 3.9104 5.5311 4.2752 2.3775 2.0246 1.8325 5.0446 3.3404 2.8409 5.2669 2.8204 3.2742 2.9746 2.6275 3.7224 6.9457 3.4096 6.7838 6.7042 6.0195 3.4120 1.9947 2.0751 1.5644 5.9492 1.5287 4.1007 4.0496 1.2516 1.3349 1.4990 3.1216 1.5110 1.6540 1.3372 1.5078 1.4767 4.3520 6.0367 3.6662 1.3463 1.7460 2.1407 1.7947 1.5760 1.5605 1.6757 1.6801 1.0541 1.1090 1.1951 2.1735 1.1862 2.0229 3.7388 1.4214 1.4055 1.6812 1.5386 1.4841 3.3950 2.2114 2.5005 2.1190 2.1592 1.2116 1.1191 2.1133 2.1846 1.0489 5.4156 7.0035 6.1892 6.5532 6.0931 7.1079 1.0853 1.0578 1.0366 1.1030 1.0867 1.0979 1.0984 1.0879 1.0866 1.0883 1.0924 1.0915 1.0959 1.1001 1.0943 1.0925
irintensity: 0.0928 0.4949 0.8406 0.3101 0.3704 6.7922 3.2215 8.4362 1.7535 1.4667 0.1861 5.0075 0.3384 5.7855 4.1551 4.5809 1.6000 1.0581 2.7758 1.5146 9.9935 14.9994 1.6080 0.2672 3.4825 2.6715 6.4352 17.0847 28.8903 34.3386 67.0093 16.5924 47.0257 17.2459 11.6058 0.1280 1.0938 4.5978 1.3875 5.9641 23.5085 1.2884 11.4291 5.0225 26.5702 6.1712 166.0468 0.3282 8.6927 8.6914 16.2572 3.5379 7.8940 7.9774 132.5293 0.1779 5.6711 22.8466 121.9611 2.0419 0.9091 320.5171 40.9587 12.7100 15.6515 1.7855 20.6139 16.6933 3.1512 22.1099 37.9612 8.3785 91.2255 1.8290 15.0422 14.9377 18.1453 258.0052 249.1552 0.4136 130.0119 5.6161 17.2404 105.0079 28.6915 13.2295 28.4381 16.8433 16.5578 6.7824 9.5971 0.2693 14.5629 24.6408 2.1542 34.5452 13.5689 14.1649 4.9285
temp: 298.150 k
press: 1.00000 atm
elementType: 8 8 6 6 6 6 6 6 6 6 6 6 6 6 6 6 6 6 6 1 1 1 1 1 1 1 1 1 1 1 1 1 1 1 1
symmnumber: 1
zpe: 733643.1 jmol-1
zpe.correction: 0.279430 hartree
zpe.thermalcorrener: 0.296747 hartree
zpe.thermalcorrenthalpy: 0.297691 hartree
zpe.thermalcorrgfe: 0.230479 hartree
zpe.sumelectzpe: -806.480781 hartree
zpe.sumelectthermal: -806.463465 hartree
zpe.sumelectthermalent: -806.462520 hartree
zpe.sumelectthermalfe: -806.529732 hartree
dipole: 5.4102 3.0688 0.4209
dipole: 6.2342
quadrupole: -137.1959 -101.0842 -115.9608
quadrupole: -13.5490 -2.8213 -2.1027
quadrupole: -19.1156 16.9961 2.1195 -13.5490 -2.8213 -2.1027
hfenergy: -806.7602112 hartree
pointgroup: C01 [X(C17H16O2)]
dipole: 2.1330703 1.1833575 0.2558753 debye
polarizability: 344.2772323|27.0880146|195.9687536|-22.4448783|13.5070779|96.8334101 unknown
InChI: InChI=1S/C17H16O2/c1-14(12-18)10-16-8-5-9-17(11-16)19-13-15-6-3-2-4-7-15/h2-12H,13H2,1H3
charge 0 multiplicity 1
35 atoms
O  1.386687 0.086694 -0.10659
O  -6.7346 -2.08635 -0.048909
C  2.573668 0.934796 0.115181
C  0.132233 0.633507 0.199938
C  3.813114 0.119795 -0.193821
C  -2.298038 0.186569 0.273139
C  -0.965545 -0.233521 0.004583
C  -0.080826 1.954963 0.66793
C  -2.503397 1.521349 0.747031
C  -1.404258 2.378034 0.935195
C  -3.363964 -0.795419 0.037421
C  3.874409 -1.261292 0.115929
C  4.947422 0.755199 -0.755599
C  -4.732389 -0.72204 0.214314
C  5.057312 -1.99287 -0.129229
C  6.134393 0.025366 -0.99188
C  6.192528 -1.3519 -0.678683
C  -5.54918 0.444352 0.724216
C  -5.481936 -1.953281 -0.143064
H  2.576202 1.268711 1.175488
H  2.522407 1.83301 -0.533204
H  -0.76483 -1.246241 -0.362482
H  0.750723 2.648383 0.820983
H  -3.507546 1.886175 0.962021
H  -2.994801 -1.761358 -0.347272
H  -1.571273 3.399009 1.295823
H  2.989484 -1.755418 0.528957
H  4.905503 1.821071 -1.013354
H  5.09424 -3.062073 0.107823
H  7.005657 0.527319 -1.427059
H  7.109912 -1.920822 -0.866336
H  -5.461556 1.325834 0.062085
H  -6.610763 0.146271 0.760955
H  -5.238428 0.750154 1.740316
H  -4.847364 -2.797173 -0.517849
