program: Gaussian 09
title: 000179316
version: EM64L-G09RevD.01
frameworkgroup: C1[X(C19H8ClF9N2OS)]
method: RPBEPBE
basis: SDD
operation: Freq
keyword: #p
keyword: freq=noraman
keyword: PBEPBE/SDD
title: #p freq=noraman PBEPBE/SDD
converged: YES YES NO NO
title: Mulliken charges:
elementType: Cl S F F F F F F F F F O N N C C C C C C C C C C C C C C C C C C C H H H H H H H H
charge: 0.072810 0.474953 -0.153128 -0.158003 -0.155854 -0.157661 -0.154653 -0.155211 -0.146331 -0.152288 -0.147715 -0.240416 -0.264028 -0.011442 0.313701 0.157031 0.325598 0.315217 -0.409024 -0.498852 0.416623 -0.444558 -0.189078 0.254414 0.240737 -0.353223 -0.345017 0.448890 -0.674430 -0.206319 -0.203629 -0.225631 0.270636 0.297064 0.308924 0.298331 0.272479 0.256547 0.241573 0.239758 0.241204
chargesum: 0.00000
title: Mulliken charges with hydrogens summed into heavy atoms:
elementType: Cl S F F F F F F F F F O N N C C C C C C C C C C C C C C C C C C C
charge: 0.072810 0.474953 -0.153128 -0.158003 -0.155854 -0.157661 -0.154653 -0.155211 -0.146331 -0.152288 -0.147715 -0.240416 -0.264028 -0.011442 0.313701 0.157031 0.325598 0.315217 -0.111960 -0.189928 0.416623 -0.146227 -0.189078 0.254414 0.240737 -0.080744 -0.088469 0.448890 -0.674430 0.035254 0.036129 0.015573 0.270636
polarizability: 3.59617721e+02 -1.72343201e+01 2.78225476e+02 -2.02016088e+01 1.06884344e+01 1.59880665e+02
1716.lowfreq: -11.5287 -4.0886 -1.7815 -0.0016 -0.0015 0.0004 2.4909 10.7590 13.9866
frequency: -11.2969 10.6190 13.9595 15.0795 18.6958 30.3110 35.7591 48.5030 66.5517 82.0727 88.2997 91.3524 107.3698 124.6293 136.5412 138.2517 149.7589 164.1642 183.1473 201.1655 236.1373 244.9401 266.0724 272.3403 277.8591 295.3313 308.4485 314.5138 334.7914 349.3048 365.1560 372.1345 386.7305 398.4403 407.3518 414.3651 439.4477 442.9721 455.9239 476.9312 484.4045 499.5452 510.1732 541.6578 548.0540 577.4042 597.0618 606.7793 607.9164 616.5820 624.1868 633.3158 633.8293 664.3801 689.9164 692.1359 696.0060 713.2920 731.5934 766.3428 779.4576 793.4168 841.6851 846.5174 921.5167 924.3423 927.7605 936.7216 954.8540 958.4708 976.4055 988.1747 990.4476 993.3438 993.9774 997.8104 1000.9817 1021.7366 1023.5795 1034.8384 1038.7335 1060.2488 1083.0374 1099.3328 1102.2874 1126.5679 1176.9567 1182.2737 1187.1280 1230.2771 1256.5862 1271.7671 1296.5234 1312.9808 1321.6328 1361.6910 1382.6250 1393.9535 1441.2196 1443.1457 1451.9895 1476.7349 1495.0993 1528.8219 1541.7777 1599.2526 1603.6523 1615.4268 1618.5886 3139.2969 3146.9402 3157.8197 3168.1963 3171.5161 3176.3816 3179.4614 3184.2376
redmass: 18.7344 10.5585 17.4673 15.1601 16.4883 12.7185 10.0926 5.9736 4.2113 11.8370 12.9598 16.0058 15.1645 12.8880 11.8949 10.2568 8.3195 8.8371 16.0316 6.9831 12.1622 5.2812 14.3168 15.5830 10.9039 5.3558 11.7427 10.3723 11.1196 13.3672 13.7011 11.9533 12.1094 10.3130 2.8407 7.4955 11.2482 13.5455 11.0555 14.9303 11.3885 6.2677 9.4808 9.9851 8.1835 9.4623 8.5938 11.4612 12.9710 7.5880 13.9196 8.1157 12.8363 7.6842 11.9515 2.5231 2.4499 3.7317 4.7524 2.4738 6.7277 12.1110 2.1049 2.1385 1.8495 2.1998 2.6262 1.4443 1.5714 12.0769 1.3965 6.2142 5.9083 8.4744 12.2881 7.6297 1.3524 3.1065 4.8149 8.4054 9.8427 7.7566 1.5591 2.8806 5.5399 3.2788 1.0534 1.4926 1.6686 2.4658 6.1088 4.9307 1.2146 2.0591 3.0382 9.8464 10.1242 8.7672 2.5817 3.3099 3.5962 2.3244 11.2932 11.7950 11.5894 6.6059 6.2118 6.3447 6.2290 1.0862 1.0892 1.0932 1.0970 1.0933 1.0928 1.1013 1.0932
irintensity: 0.0481 0.1992 0.2733 0.4698 0.0475 0.2601 0.6660 0.9685 1.3130 0.0299 3.5762 1.1016 1.2517 1.4657 0.8744 0.1806 0.2995 0.1025 0.5537 1.4385 0.8193 0.7398 1.1269 0.5474 0.6515 0.5168 0.0211 1.3322 8.5448 6.8013 14.7493 6.8013 7.7941 7.9080 0.0583 7.3455 0.2381 2.6413 8.2690 4.7830 2.3063 2.1365 6.3203 0.5837 28.9634 0.4906 4.3929 8.2404 33.8622 1.1368 3.4527 4.7225 27.1777 7.0674 3.5540 16.9089 13.1419 79.1891 75.5667 8.3889 12.6110 48.6718 24.2117 20.9642 55.1518 80.2394 37.7526 4.6070 25.6848 61.7976 0.9879 0.8323 7.1421 23.6481 217.7978 304.1892 1.9899 7.3075 61.4978 18.0906 186.6905 149.4900 14.1699 119.5026 78.9923 317.3933 0.0140 89.2236 87.4732 413.8166 97.5860 327.1353 0.5032 98.8703 276.8781 32.7236 6.0529 1.1696 8.0029 8.2254 3.8757 61.3869 121.4402 43.7629 175.0671 5.4782 2.4736 10.6096 18.2205 0.9556 2.1239 13.8048 12.0013 4.5936 3.6898 5.8487 1.5260
temp: 298.150 k
press: 1.00000 atm
elementType: 17 16 9 9 9 9 9 9 9 9 9 8 7 7 6 6 6 6 6 6 6 6 6 6 6 6 6 6 6 6 6 6 6 1 1 1 1 1 1 1 1
symmnumber: 1
zpe: 622836.9 jmol-1
zpe.correction: 0.237226 hartree
zpe.thermalcorrener: 0.266187 hartree
zpe.thermalcorrenthalpy: 0.267131 hartree
zpe.thermalcorrgfe: 0.171723 hartree
zpe.sumelectzpe: -2667.905645 hartree
zpe.sumelectthermal: -2667.876684 hartree
zpe.sumelectthermalent: -2667.875740 hartree
zpe.sumelectthermalfe: -2667.971148 hartree
dipole: -1.6315 1.3081 0.9976
dipole: 2.3169
quadrupole: -239.2915 -203.0798 -196.3759
quadrupole: -11.4758 -5.2388 4.4110
quadrupole: -26.3758 9.8359 16.5399 -11.4758 -5.2388 4.4110
hfenergy: -2668.1428707 hartree
pointgroup: C01 [X(C19H8Cl1F9N2O1S1)]
dipole: -0.6776909 -0.5957491 0.1293432 debye
polarizability: 361.1899051|25.6349085|209.3606161|6.8000226|-57.577631|227.173341 unknown
InChI: InChI=1S/C19H8ClF9N2OS/c20-14-13(19(27,28)29)30-16(33-14)31(12-4-2-1-3-5-12)15(32)9-6-10(17(21,22)23)8-11(7-9)18(24,25)26/h1-8H
charge 0 multiplicity 1
41 atoms
Cl 6.150538 1.981013 -1.395261
S  3.083577 1.63496 -1.457123
F  -3.821253 1.724376 -4.054535
F  -5.107845 -0.039731 -3.440973
F  -5.585289 2.028869 -2.655677
F  -3.240748 0.482641 2.997828
F  -5.309034 0.530855 2.056792
F  -4.121924 -1.398799 2.095415
F  6.962533 -0.183619 0.534507
F  5.489289 -0.582831 2.212433
F  5.68725 -2.058312 0.505599
O  0.504014 1.736263 -1.814106
N  1.005636 0.038459 -0.303706
N  3.287706 -0.385888 0.294135
C  -1.392679 0.677995 -0.790597
C  0.086382 0.848135 -1.006028
C  -3.621515 0.911111 -1.773547
C  -3.390878 0.35526 0.579135
C  -1.983997 0.383152 0.459329
C  -2.221126 0.960336 -1.905251
C  0.60551 -1.187931 0.392719
C  -4.221089 0.604932 -0.531641
C  2.392486 0.306572 -0.386726
C  -4.510376 1.160016 -2.963975
C  -4.00687 0.007216 1.908627
C  0.820306 -1.315403 1.782055
C  0.016923 -2.230673 -0.355746
C  4.595114 0.052599 0.060163
C  4.710289 1.111301 -0.825561
C  0.410043 -2.497796 2.433857
C  -0.396655 -3.407315 0.30703
C  -0.205286 -3.5405 1.701306
C  5.672248 -0.675199 0.808619
H  -1.36712 0.196416 1.341089
H  -1.758144 1.237313 -2.856672
H  -5.309926 0.584822 -0.426261
H  1.312485 -0.512651 2.338131
H  -0.111146 -2.125612 -1.43837
H  0.573279 -2.604984 3.510932
H  -0.860057 -4.217173 -0.2656
H  -0.525248 -4.453992 2.213153
