program: Gaussian 09
title: 000179263
version: EM64L-G09RevD.01
frameworkgroup: C1[X(C12H2Br3ClF3N3OS)]
method: RPBEPBE
basis: SDD
operation: Freq
keyword: #p
keyword: freq=noraman
keyword: PBEPBE/SDD
title: #p freq=noraman PBEPBE/SDD
converged: YES YES NO NO
title: Mulliken charges:
elementType: Br Br Br Cl S F F F O N N N C C C C C C C C C C C C H H
charge: 0.114492 0.101055 0.115665 0.089336 0.477959 -0.141629 -0.180727 -0.109148 -0.205145 -0.505046 0.096956 0.020534 0.743315 -0.446897 0.226729 0.279259 -0.609991 -0.389929 0.708193 0.296122 -0.157799 -0.482402 -0.436088 -0.251750 0.364165 0.282770
chargesum: 0.00000
title: Mulliken charges with hydrogens summed into heavy atoms:
elementType: Br Br Br Cl S F F F O N N N C C C C C C C C C C C C
charge: 0.114492 0.101055 0.115665 0.089336 0.477959 -0.141629 -0.180727 -0.109148 -0.205145 -0.140880 0.096956 0.020534 0.743315 -0.446897 0.226729 0.279259 -0.609991 -0.389929 0.708193 0.296122 0.124971 -0.482402 -0.436088 -0.251750
polarizability: 3.80706872e+02 1.05490153e+01 2.22408297e+02 5.36425618e+00 1.66132612e+00 1.42779094e+02
1716.lowfreq: -4.0198 -3.0232 0.0006 0.0007 0.0013 1.7793 11.9640 17.4865 22.0832
frequency: 11.9575 17.4796 22.0800 39.4384 55.1935 63.7468 72.8085 91.2575 106.3511 116.0206 116.7567 120.7700 127.0987 139.4547 152.4691 188.1440 220.6499 225.7434 238.5679 268.1336 276.4403 300.1175 308.2854 321.2190 325.7526 344.7317 358.4727 400.1001 451.8309 455.8072 458.0850 484.7606 529.5230 532.4480 572.3738 587.1258 601.8432 610.1399 635.6939 637.3935 646.3920 669.2717 674.5735 729.6616 745.6923 766.9936 815.0412 851.2288 882.1026 940.0153 947.4795 959.7647 1031.0895 1058.3039 1068.7003 1140.3467 1200.6523 1225.0713 1264.3225 1318.4961 1332.6642 1343.4354 1418.9887 1441.4287 1485.2295 1501.7748 1531.9221 1558.6351 1584.6587 2190.3714 3187.0107 3469.9961
redmass: 23.7463 30.8461 30.2347 18.0533 16.9442 18.4928 21.6969 24.7560 17.7910 17.5494 25.6094 16.1407 16.4740 23.9071 18.1104 11.3705 11.6194 19.2939 11.1582 18.4125 13.9953 9.5914 19.7217 16.4622 12.0602 13.6118 12.1880 16.7962 11.0802 14.2624 12.1047 10.9385 7.3346 6.3234 12.6917 4.8907 3.9910 2.9807 5.3555 14.7408 6.0849 10.3351 10.6725 11.3018 8.4061 7.4844 12.9521 10.4231 1.4390 11.9838 7.1752 12.6042 7.7303 11.8058 8.7382 11.5565 1.8155 6.5049 3.4699 8.6701 9.1762 9.1862 3.9833 10.9433 3.0744 6.3258 4.7458 9.8987 5.2658 12.6276 1.0934 1.0783
irintensity: 0.3179 0.1440 0.0879 1.1351 1.8834 0.7006 0.4455 1.6049 2.2875 0.3009 0.4109 0.4587 2.4107 0.5174 1.0902 6.5208 0.0624 0.0397 4.4270 6.3181 2.0706 1.5475 0.6469 6.4171 5.4670 4.4863 6.9708 2.4807 15.4970 1.6924 1.2739 2.4631 1.3682 3.7334 29.4794 4.5310 10.3492 42.6825 20.2816 4.9585 13.7495 4.7993 16.0553 31.7775 53.5512 14.7887 83.6741 24.2678 11.1072 165.5213 17.3529 158.3576 101.3563 7.7066 88.1609 167.3821 2.5079 113.7848 122.7500 140.5021 51.0288 44.8949 200.5841 294.1663 96.8973 300.8954 108.2979 56.3312 83.3190 10.3320 1.2776 119.0871
temp: 298.150 k
press: 1.00000 atm
elementType: 35 35 35 17 16 9 9 9 8 7 7 7 6 6 6 6 6 6 6 6 6 6 6 6 1 1
symmnumber: 1
zpe: 314424.0 jmol-1
zpe.correction: 0.119758 hartree
zpe.thermalcorrener: 0.143410 hartree
zpe.thermalcorrenthalpy: 0.144355 hartree
zpe.thermalcorrgfe: 0.060648 hartree
zpe.sumelectzpe: -1894.253193 hartree
zpe.sumelectthermal: -1894.229541 hartree
zpe.sumelectthermalent: -1894.228596 hartree
zpe.sumelectthermalfe: -1894.312303 hartree
dipole: -1.9879 -2.1245 -0.4025
dipole: 2.9372
quadrupole: -184.2614 -181.1002 -184.1371
quadrupole: -17.0473 12.1111 -1.9506
quadrupole: -1.0952 2.0660 -0.9709 -17.0473 12.1111 -1.9506
hfenergy: -1894.3729509 hartree
pointgroup: C01 [X(C12H2Br3Cl1F3N3O1S1)]
dipole: 0.8163184 0.4350617 -0.6926114 debye
dipolederiv: -0.0736293 0.1736819 -0.1216839 0.1456449 -0.3063968 0.2526489 -0.1032789 0.2525479 -0.1198754 -0.2731733 -0.2834525 0.1744153 -0.2861717 -0.2731046 0.2213177 0.1939392 0.1981686 -0.0910902 -0.6854665 0.1799278 -0.064214 0.1869934 -0.0225874 0.037223 -0.0911343 0.0480292 0.0249796 -0.7666545 0.2992469 0.1874031 0.3534013 -0.1209544 -0.1229958 0.2565508 -0.1328833 -0.0854157 -0.0598819 0.054847 -0.0351582 0.0171995 0.132229 -0.1504589 -0.0796409 -0.1594118 -0.0574672 -0.3409894 0.1916656 0.0254006 0.0915851 -0.7109912 -0.0559241 -0.0744841 -0.0141736 -0.3918605 -0.6578188 -0.0945835 0.1997432 -0.1850611 -0.3928476 -0.0093396 0.1204999 0.0190835 -0.6190657 -0.6410251 -0.0474598 -0.2258523 -0.1125504 -0.2894727 -0.1375824 -0.3281383 -0.1119738 -0.5166522 -0.7487029 0.0369715 -0.1385053 0.1118214 -0.3032756 -0.0966132 0.3518498 -0.184646 -0.766576 -1.4192193 0.2480994 0.3212622 0.3356935 -0.4303225 -0.1966823 0.519396 -0.1784979 -0.5994298 -0.7251535 0.1299639 0.0004581 0.4418888 -0.390147 -0.2969182 0.4248937 -0.3868363 -0.5852797 -0.2507548 -0.0195752 0.0248972 -0.0434213 -0.2196283 0.0167645 0.0387466 0.0084715 -0.2230967 0.8592233 -0.2607491 -0.0951503 -0.2510589 -0.2639293 0.3856929 0.1605216 0.2802053 -0.1763851 -0.5364706 0.069989 -0.0475161 -0.098144 0.032959 0.1827771 -0.2833054 0.2429049 0.1642425 0.3293765 -0.1217669 -0.0663562 -0.166845 -0.0910495 -0.1200438 -0.0151882 -0.1291099 -0.268991 1.7874197 -0.3146993 -0.1372097 -0.2169942 0.2938301 0.1858627 -0.8587537 0.3758272 1.1426631 0.1988152 -0.1159683 0.1102518 -0.1982259 0.5471329 -0.5281225 0.161233 -0.5363399 0.2337963 0.5639628 0.453324 -0.2308606 0.3272037 0.5946702 -0.4442343 -0.2958987 -0.455454 0.1757494 -0.3855038 0.1401845 -0.0532974 0.1457592 -0.1202617 0.2423664 -0.0401476 0.2602388 0.0514033 1.5605786 -0.0598483 -0.0470291 0.259034 1.5269938 0.3365594 0.2925175 0.2076256 1.7320436 -0.7887499 -0.1046052 0.1119983 -0.1455777 -0.1225864 0.0844411 0.1056505 0.0890401 -0.0405591 1.2745368 -0.332412 0.1427379 -0.1320158 0.1539577 -0.2233151 0.022811 -0.2265978 -0.0061488 1.3277289 -0.378753 -0.065235 -0.6547783 0.3217736 0.407802 -0.5070985 0.5062274 0.5755843 0.1312847 0.0639608 -0.0562419 0.0785516 0.097324 -0.0732531 -0.0725382 -0.0574915 0.0687651 0.2451128 0.0756058 0.0858588 -0.0192822 0.2841556 0.0461803 0.1105086 0.0294755 0.2635688 0.0751543 0.0164051 -0.0001166 0.0153501 0.0725292 0.0558473 -0.0095114 0.0555705 0.1150969 unknown
polarizability: 374.373931|-27.1302384|194.2721483|-30.3308676|-34.987336|177.2481844 unknown
InChI: InChI=1S/C12H2Br3ClF3N3OS/c13-4-1-5(14)7(6(15)3(4)2-20)21-10(23)8-9(12(17,18)19)22-11(16)24-8/h1,21H
charge 0 multiplicity 1
26 atoms
Br -1.776339 -1.970888 1.824884
Br -0.668298 2.685333 -1.499963
Br -6.102568 1.283535 -0.321968
Cl 6.025641 -2.120058 -1.556311
S  2.993315 -1.55681 -1.946193
F  2.347597 1.904732 1.191132
F  1.869347 0.035512 2.390738
F  3.991389 0.832674 2.318061
O  0.25996 -0.45114 -2.066943
N  -0.039527 0.040126 0.202204
N  4.430484 -0.679669 0.128112
N  -5.528942 -1.702631 1.950916
C  -1.427233 0.33518 0.084507
C  2.184588 -0.58542 -0.653286
C  3.123994 -0.227147 0.320517
C  0.733516 -0.32125 -0.899673
C  -2.3874 -0.462945 0.760317
C  -1.903598 1.441533 -0.67408
C  -3.78573 -0.203103 0.675306
C  2.869749 0.632786 1.530786
C  -3.281939 1.704333 -0.80397
C  -4.211195 0.889014 -0.13578
C  4.521497 -1.379118 -0.98073
C  -4.733854 -1.022156 1.373942
H  0.344888 -0.078344 1.146419
H  -3.622444 2.551719 -1.402343
