program: Gaussian 09
title: 000179229
version: EM64L-G09RevD.01
frameworkgroup: C1[X(C8H3F13O3)]
method: RPBEPBE
basis: SDD
operation: Freq
keyword: #p
keyword: freq=noraman
keyword: PBEPBE/SDD
title: #p freq=noraman PBEPBE/SDD
converged: YES YES NO NO
title: Mulliken charges:
elementType: F F F F F F F F F F F F F O O O C C C C C C C C H H H
charge: -0.114958 -0.134808 -0.128791 -0.123509 -0.127872 -0.173087 -0.146202 -0.124642 -0.121727 -0.115908 -0.127395 -0.130196 -0.128566 -0.272778 -0.225778 -0.408934 0.201336 0.358383 0.306006 0.253422 0.408688 -0.341508 0.237538 0.314440 0.261240 0.241713 0.363895
chargesum: 0.00000
title: Mulliken charges with hydrogens summed into heavy atoms:
elementType: F F F F F F F F F F F F F O O O C C C C C C C C
charge: -0.114958 -0.134808 -0.128791 -0.123509 -0.127872 -0.173087 -0.146202 -0.124642 -0.121727 -0.115908 -0.127395 -0.130196 -0.128566 -0.272778 -0.225778 -0.045039 0.201336 0.358383 0.306006 0.253422 0.408688 0.161444 0.237538 0.314440
polarizability: 1.27666076e+02 3.25435810e+00 9.80424346e+01 -1.16931837e+00 -6.33510331e+00 9.50778153e+01
1716.lowfreq: -3.9220 -2.8401 0.0008 0.0009 0.0013 2.0024 13.3971 17.0146 25.9691
frequency: 12.6260 16.9651 25.9365 37.4115 43.5580 52.8952 68.4822 75.0203 82.7481 105.1497 123.9423 142.6054 160.4680 163.3491 189.7010 202.3314 205.9625 220.9265 246.5497 253.4461 269.6447 276.8392 283.6993 298.6404 306.9393 332.8471 338.2516 376.9725 381.9567 405.1388 417.4340 450.2785 457.7178 475.3980 484.2530 497.5188 516.7670 526.4157 536.9803 539.0443 564.9325 616.6368 652.2787 688.1629 711.5394 716.5361 753.4974 878.4256 888.8169 931.9084 981.3377 982.7473 993.5093 1006.9208 1019.0286 1030.0814 1045.2104 1069.7433 1071.6750 1078.4507 1094.7709 1148.1493 1153.4461 1166.4609 1195.5308 1207.7776 1219.6663 1231.7026 1339.5895 1387.3584 1450.8721 1778.2440 2997.8708 3110.6731 3558.6094
redmass: 11.9634 17.0801 15.5813 11.7963 13.3566 12.0893 12.3697 10.5502 8.6167 5.4676 17.4619 9.5794 12.8078 17.0013 17.3306 17.4761 17.2331 17.3351 14.7192 10.9453 9.5891 16.6505 17.7125 16.8576 4.8438 3.5209 11.7990 9.2238 3.9225 4.3840 3.5515 14.2319 12.6503 14.3933 14.5596 14.5908 14.5270 12.7005 15.1340 15.2126 16.6128 14.6278 13.7866 16.7158 15.9028 8.0445 13.5337 2.5537 12.4144 11.1803 12.3729 12.1211 8.0350 9.1280 9.0264 5.8788 12.2847 9.6798 3.1018 9.5258 12.8828 7.7101 12.2529 12.6294 11.2099 13.3008 1.3716 10.3207 1.2387 1.2311 1.0783 12.1316 1.0667 1.0968 1.0663
irintensity: 0.1417 0.0339 0.1975 0.7098 0.3926 0.6859 0.8368 0.9113 1.0477 2.2522 0.0031 1.0304 0.3193 0.3646 1.4775 1.6068 9.8899 1.0483 4.7336 6.0223 3.4526 4.0985 0.1238 1.7764 9.2993 40.0099 4.7668 14.1775 41.0345 37.8841 12.2232 14.2008 29.1549 1.8420 3.3579 1.2555 9.3034 11.4548 9.2966 8.6027 2.8834 44.0675 47.1236 10.6805 1.6567 41.9968 1.9685 37.3336 107.4119 107.5766 67.1319 89.9071 139.3935 98.0983 93.4793 97.5039 310.3195 316.5537 408.2394 454.8189 240.3342 43.1738 194.9826 61.5174 45.9250 253.0612 50.2262 38.4665 25.0649 6.7355 7.0211 17.9430 28.5682 2.9431 22.7155
temp: 298.150 k
press: 1.00000 atm
elementType: 9 9 9 9 9 9 9 9 9 9 9 9 9 8 8 8 6 6 6 6 6 6 6 6 1 1 1
symmnumber: 1
zpe: 318954.2 jmol-1
zpe.correction: 0.121483 hartree
zpe.thermalcorrener: 0.146209 hartree
zpe.thermalcorrenthalpy: 0.147153 hartree
zpe.thermalcorrgfe: 0.063078 hartree
zpe.sumelectzpe: -1828.298274 hartree
zpe.sumelectthermal: -1828.273548 hartree
zpe.sumelectthermalent: -1828.272604 hartree
zpe.sumelectthermalfe: -1828.356679 hartree
dipole: -1.9808 -1.2989 -0.7965
dipole: 2.4990
quadrupole: -145.0386 -136.4671 -133.0241
quadrupole: 0.5944 -5.4179 2.0894
quadrupole: -6.8620 1.7095 5.1525 0.5944 -5.4179 2.0894
hfenergy: -1828.419757 hartree
pointgroup: C01 [X(C8H3F13O3)]
dipole: -0.7473701 -0.6387325 -0.0109853 debye
polarizability: 127.3621519|4.0546351|92.0243552|-2.3451736|-4.4450835|101.3998189 unknown
InChI: InChI=1S/C8H3F13O3/c9-2(10)3(11)23-8(20,21)5(14,6(15,16)17)24-7(18,19)4(12,13)1-22/h22H,1H2
charge 0 multiplicity 1
27 atoms
F  -0.302628 1.474021 1.146178
F  2.264778 0.605738 2.04249
F  2.68801 1.771205 0.142829
F  -1.0426 -0.967305 -1.476458
F  -0.938616 -1.40202 0.741621
F  3.63593 -0.605829 -1.122723
F  4.722861 0.006411 0.792962
F  -1.245483 1.913077 -1.838523
F  0.902414 1.320708 -2.238452
F  0.429022 3.029868 -0.821249
F  -4.07448 -0.646604 -1.386107
F  -5.387133 -1.72981 0.873843
F  -3.728744 -0.970151 2.246951
O  1.179462 -0.027231 0.071766
O  -2.406043 0.246942 0.009307
O  4.316934 -2.871057 0.431687
C  -0.027266 0.734621 -0.037568
C  2.383614 0.483327 0.630766
C  -1.145237 -0.360329 -0.19745
C  3.510883 -0.543899 0.306128
C  0.019359 1.769162 -1.251545
C  3.271739 -1.962138 0.853912
C  -3.550249 -0.546883 -0.106882
C  -4.195317 -1.060646 0.961416
H  3.316867 -1.932287 1.953416
H  2.262022 -2.290809 0.535866
H  4.321898 -2.941683 -0.557482
