program: Gaussian 09
title: 000016058
version: EM64L-G09RevD.01
frameworkgroup: C1[X(C12H22O6)]
method: RPBEPBE
basis: SDD
operation: Freq
keyword: #pfreq=noraman
keyword: PBEPBE/SDD
title: #p freq=noraman PBEPBE/SDD
converged: YES YES NO NO
title: Mulliken charges:
elementType: O O O O O O C C C C C C C C C C C C H H H H H H H H H H H H H H H H H H H H H H
charge: -0.303542 -0.318112 -0.265640 -0.269637 -0.265866 -0.268501 -0.038006 -0.071612 -0.357843 -0.355269 -0.250505 -0.278480 -0.247555 -0.238954 -0.244143 -0.246250 -0.248178 -0.244144 0.253556 0.317408 0.214221 0.229193 0.209792 0.220870 0.209439 0.179933 0.201498 0.187041 0.207156 0.176473 0.204247 0.175401 0.208079 0.173054 0.210200 0.172406 0.174411 0.207041 0.171889 0.208929
chargesum: 0.00000
title: Mulliken charges with hydrogens summed into heavy atoms:
elementType: O O O O O O C C C C C C C C C C C C
charge: -0.303542 -0.318112 -0.265640 -0.269637 -0.265866 -0.268501 0.215550 0.245797 0.085570 0.075394 0.138867 0.110059 0.136074 0.140694 0.136990 0.136356 0.133274 0.136673
polarizability: 1.73358030e+02 1.11947116e+01 1.59506786e+02 4.67851195e+00 1.71143491e+00 1.19360413e+02
1716.lowfreq: -8.1875 -4.4127 0.0002 0.0007 0.0009 4.6037 13.2342 26.3265 28.9141
frequency: 12.5452 26.2823 28.7906 40.8899 42.6959 55.2983 65.5942 69.1156 80.6998 105.1233 126.8366 135.5822 142.9594 148.8862 159.0699 189.0299 202.3541 262.9003 281.0923 297.1650 300.9900 334.0871 388.5254 393.8159 435.3469 442.8570 487.1650 521.1293 548.6934 698.6867 738.2834 787.3951 791.3536 797.7965 811.0804 836.0495 841.7145 885.4280 896.7472 923.4796 933.5820 958.7554 969.3537 992.5913 1001.0667 1032.1166 1033.3700 1036.3199 1043.1779 1058.8173 1065.1995 1073.5988 1076.1987 1099.7843 1106.1496 1107.7976 1109.9532 1114.7992 1116.2683 1126.0513 1144.6215 1145.5652 1189.6777 1199.2020 1205.1121 1209.1973 1213.1966 1240.6615 1245.8431 1249.9763 1252.9282 1254.1973 1313.3327 1327.6637 1334.8806 1343.7764 1369.6817 1379.3839 1396.3242 1411.8555 1425.1618 1427.6974 1449.4708 1450.6007 1450.8053 1458.3285 1469.3488 1470.9127 1473.0395 1474.6602 1482.4121 1484.3900 2901.5078 2908.0093 2910.9063 2913.2172 2923.1557 2927.6296 2931.9694 2935.5481 2975.1894 2976.7608 2978.5017 2979.6261 2980.9623 2990.8983 2992.3308 2993.7357 3063.0849 3064.2001 3118.4984 3127.0587 3171.2613 3172.0109
redmass: 5.1144 5.0158 4.0071 6.3482 3.3958 3.3883 4.1344 4.9916 3.7391 3.4549 3.5813 3.6575 2.9408 4.1459 4.5429 2.6033 2.2651 3.1469 2.7863 3.2259 3.4024 2.7365 2.8693 2.7091 2.8312 3.2103 2.6122 2.8727 2.9767 5.7124 7.8437 2.6034 4.2312 2.5235 3.4425 2.2153 2.9605 2.2272 1.1967 2.2087 2.0378 1.3740 2.0613 2.9494 2.6039 1.4162 1.9627 1.9407 2.0447 2.3500 3.8826 3.6429 3.1261 1.7380 3.0952 1.5905 1.4451 1.7320 1.5020 2.0120 1.5325 1.6178 1.0916 1.1545 1.2244 1.1644 1.1915 1.4736 1.1123 1.1721 1.3744 1.1696 1.2578 1.2165 1.2357 1.2905 1.4596 1.4230 1.5117 1.6100 1.7094 1.7386 1.0890 1.0849 1.0848 1.1103 1.0888 1.0895 1.1032 1.1730 1.2238 1.1300 1.0610 1.0587 1.0590 1.0592 1.0567 1.0597 1.0592 1.0595 1.0975 1.1048 1.1011 1.1022 1.1029 1.0989 1.1004 1.1013 1.0532 1.0535 1.0910 1.0933 1.1180 1.1183
irintensity: 0.1611 0.9594 3.4971 0.5512 2.0067 0.2422 2.2820 3.1307 7.2205 1.7506 7.7338 4.8440 7.3561 14.3696 11.5296 0.8064 5.4143 3.0034 4.5772 4.4527 2.9730 0.2029 4.7179 1.6260 0.9178 11.7969 7.9088 4.4520 0.5790 12.1004 6.1572 3.7592 40.5895 13.8770 39.9660 10.2253 12.5032 4.4211 5.2550 12.9724 47.8967 0.2168 3.8293 39.9320 37.2812 0.9639 3.1644 9.8262 7.2371 5.1445 16.8227 272.7147 118.4598 8.2191 3.2579 12.0084 5.2126 40.9076 9.2070 16.2652 2.5807 3.4787 6.3917 11.4959 9.6002 9.4319 9.2597 4.3947 0.7787 8.7300 4.2913 4.1197 20.3416 42.8558 36.6689 9.4809 3.7999 1.5633 4.0269 6.2089 2.0765 3.6646 6.0991 10.3932 20.8582 12.6665 4.8484 6.4256 4.6745 9.1431 3.3535 5.4637 69.5311 4.4141 2.2776 26.0123 37.3813 73.5262 284.8855 158.5349 43.6474 87.6622 55.3876 46.3575 2.0719 126.0401 30.1299 34.9840 30.1733 33.3075 10.7399 10.4035 28.3868 25.5373
temp: 298.150 k
press: 1.00000 atm
elementType: 8 8 8 8 8 8 6 6 6 6 6 6 6 6 6 6 6 6 1 1 1 1 1 1 1 1 1 1 1 1 1 1 1 1 1 1 1 1 1 1
symmnumber: 1
zpe: 868898.3 jmol-1
zpe.correction: 0.330946 hartree
zpe.thermalcorrener: 0.352226 hartree
zpe.thermalcorrenthalpy: 0.353170 hartree
zpe.thermalcorrgfe: 0.275817 hartree
zpe.sumelectzpe: -920.154429 hartree
zpe.sumelectthermal: -920.133149 hartree
zpe.sumelectthermalent: -920.132205 hartree
zpe.sumelectthermalfe: -920.209558 hartree
dipole: -4.4162 0.8598 0.8605
dipole: 4.5807
quadrupole: -107.6848 -76.4006 -105.9265
quadrupole: -3.4684 4.8468 1.3983
quadrupole: -11.0141 20.2700 -9.2559 -3.4684 4.8468 1.3983
hfenergy: -920.485375 hartree
pointgroup: C01 [X(C12H22O6)]
dipole: -1.7626816 -0.2061661 0.3134694 debye
polarizability: 165.3504796|13.1712732|167.4855855|4.4224122|2.297001|119.3891646 unknown
InChI: InChI=1S/C12H22O6/c1(13-3-5-15-7-11-9-17-11)2-14-4-6-16-8-12-10-18-12/h11-12H,1-10H2
charge 0 multiplicity 1
40 atoms
O  0.502692 2.827735 0.157772
O  4.279805 1.553769 -0.421712
O  -2.460965 1.539316 -0.506945
O  2.160343 -1.48145 0.229568
O  -2.914885 -1.319441 0.376703
O  -0.445641 -3.010045 -0.249895
C  -0.760192 3.221189 -0.576308
C  3.0653 0.727849 -0.027916
C  0.111025 4.279122 0.028838
C  4.05762 1.133792 1.01404
C  -2.066479 2.824884 0.067297
C  3.077483 -0.677902 -0.588209
C  -3.646127 0.969611 0.140905
C  1.963997 -2.829387 -0.309999
C  -3.825668 -0.453059 -0.37045
C  0.781121 -3.461321 0.411135
C  -2.837585 -2.676292 -0.17003
C  -1.656471 -3.38233 0.482936
H  -0.706408 3.042952 -1.657627
H  2.117138 1.274825 -0.086554
H  -0.192345 4.752578 0.972138
H  0.758178 4.881669 -0.619199
H  4.772609 0.390415 1.390357
H  3.80611 1.950654 1.700729
H  -1.931367 2.747645 1.168158
H  -2.845595 3.596698 -0.140861
H  2.737894 -0.671797 -1.647424
H  4.110517 -1.091379 -0.555273
H  -3.519126 0.9477 1.244502
H  -4.5439 1.582093 -0.103364
H  1.74706 -2.792227 -1.399563
H  2.883184 -3.438067 -0.15261
H  -3.597392 -0.482554 -1.457825
H  -4.881015 -0.779008 -0.221208
H  0.794118 -3.146658 1.476782
H  0.852701 -4.57257 0.366707
H  -3.782231 -3.227386 0.042496
H  -2.680927 -2.65129 -1.269825
H  -1.802306 -4.486725 0.446675
H  -1.58807 -3.069307 1.547064
